{
	"info": {
		"_postman_id": "a176f002-489e-4e2b-968e-bcbc4efa7a10",
		"name": "s36",
		"schema": "https://schema.getpostman.com/json/collection/v2.1.0/collection.json",
		"_exporter_id": "25264967"
	},
	"item": [
		{
			"name": "GET all tasks",
			"request": {
				"method": "GET",
				"header": [],
				"url": {
					"raw": "http://localhost:3001/tasks",
					"protocol": "http",
					"host": [
						"localhost"
					],
					"port": "3001",
					"path": [
						"tasks"
					]
				}
			},
			"response": []
		},
		{
			"name": "CREATE task",
			"request": {
				"method": "POST",
				"header": [],
				"body": {
					"mode": "raw",
					"raw": "{\r\n    \"name\": \"mag laba ng damit\"\r\n}",
					"options": {
						"raw": {
							"language": "json"
						}
					}
				},
				"url": {
					"raw": "http://localhost:3001/tasks",
					"protocol": "http",
					"host": [
						"localhost"
					],
					"port": "3001",
					"path": [
						"tasks"
					]
				}
			},
			"response": []
		},
		{
			"name": "DELETE task",
			"request": {
				"method": "DELETE",
				"header": [],
				"url": {
					"raw": "http://localhost:3001/tasks/63c5481e5b6f8c7d3aa9cc9e",
					"protocol": "http",
					"host": [
						"localhost"
					],
					"port": "3001",
					"path": [
						"tasks",
						"63c5481e5b6f8c7d3aa9cc9e"
					]
				}
			},
			"response": []
		},
		{
			"name": "UPDATE task",
			"request": {
				"method": "PUT",
				"header": [],
				"body": {
					"mode": "raw",
					"raw": "{\r\n    \"name\": \"mag linis ng bahay\"\r\n}",
					"options": {
						"raw": {
							"language": "json"
						}
					}
				},
				"url": {
					"raw": "http://localhost:3001/tasks/63c547565b6f8c7d3aa9cc9c",
					"protocol": "http",
					"host": [
						"localhost"
					],
					"port": "3001",
					"path": [
						"tasks",
						"63c547565b6f8c7d3aa9cc9c"
					]
				}
			},
			"response": []
		},
		{
			"name": "GET specific task",
			"request": {
				"method": "GET",
				"header": [],
				"url": {
					"raw": "http://localhost:3001/tasks/63c547565b6f8c7d3aa9cc9c",
					"protocol": "http",
					"host": [
						"localhost"
					],
					"port": "3001",
					"path": [
						"tasks",
						"63c547565b6f8c7d3aa9cc9c"
					]
				}
			},
			"response": []
		},
		{
			"name": "changing status of a task",
			"request": {
				"method": "PUT",
				"header": [],
				"body": {
					"mode": "raw",
					"raw": "",
					"options": {
						"raw": {
							"language": "json"
						}
					}
				},
				"url": {
					"raw": "http://localhost:3001/tasks/63c547565b6f8c7d3aa9cc9c/complete",
					"protocol": "http",
					"host": [
						"localhost"
					],
					"port": "3001",
					"path": [
						"tasks",
						"63c547565b6f8c7d3aa9cc9c",
						"complete"
					]
				}
			},
			"response": []
		}
	]
}