{
	"info": {
		"_postman_id": "fbb26e20-f5fe-4f95-84da-0edb424e97dd",
		"name": "b244-Course Booking",
		"schema": "https://schema.getpostman.com/json/collection/v2.1.0/collection.json",
		"_exporter_id": "25264966"
	},
	"item": [
		{
			"name": "Check email",
			"request": {
				"method": "POST",
				"header": [],
				"body": {
					"mode": "raw",
					"raw": "{\r\n    \"email\": \"jerome@mail.com\"\r\n}",
					"options": {
						"raw": {
							"language": "json"
						}
					}
				},
				"url": {
					"raw": "localhost:4000/users/checkEmail",
					"host": [
						"localhost"
					],
					"port": "4000",
					"path": [
						"users",
						"checkEmail"
					]
				}
			},
			"response": []
		},
		{
			"name": "User Registratioon",
			"request": {
				"method": "POST",
				"header": [],
				"body": {
					"mode": "raw",
					"raw": "{\r\n    \"firstName\": \"kristoff\",\r\n    \"lastName\": \"Del Rio\",\r\n    \"email\": \"kirstoff@mail.com\",\r\n    \"mobileNo\": \"0987654321\",\r\n    \"password\": \"kristoff1234\"\r\n}",
					"options": {
						"raw": {
							"language": "json"
						}
					}
				},
				"url": {
					"raw": "localhost:4000/users/register",
					"host": [
						"localhost"
					],
					"port": "4000",
					"path": [
						"users",
						"register"
					]
				}
			},
			"response": []
		},
		{
			"name": "User Login",
			"request": {
				"method": "POST",
				"header": [],
				"body": {
					"mode": "raw",
					"raw": "{\r\n    \"email\": \"john@mail.com\",\r\n    \"password\": \"john1234\"\r\n}",
					"options": {
						"raw": {
							"language": "json"
						}
					}
				},
				"url": {
					"raw": "http://localhost:4000/users/login",
					"protocol": "http",
					"host": [
						"localhost"
					],
					"port": "4000",
					"path": [
						"users",
						"login"
					]
				}
			},
			"response": []
		},
		{
			"name": "Get Details",
			"protocolProfileBehavior": {
				"disableBodyPruning": true
			},
			"request": {
				"auth": {
					"type": "bearer",
					"bearer": [
						{
							"key": "token",
							"value": "eyJhbGciOiJIUzI1NiIsInR5cCI6IkpXVCJ9.eyJpZCI6IjYzYzdlZjBjOWJlMjg5NzUwMGM0YTQ5ZSIsImVtYWlsIjoiam9obkBtYWlsLmNvbSIsImlzQWRtaW4iOmZhbHNlLCJpYXQiOjE2NzQ0NzE0MjZ9.SvmKg3zaqdiMZ-RNoD7Fr2afVzQUtS5XaRQmY35nITc",
							"type": "string"
						}
					]
				},
				"method": "GET",
				"header": [],
				"body": {
					"mode": "raw",
					"raw": "{\r\n    \"id\": \"63c7ef0c9be2897500c4a49e\"\r\n}",
					"options": {
						"raw": {
							"language": "json"
						}
					}
				},
				"url": {
					"raw": "localhost:4000/users/details",
					"host": [
						"localhost"
					],
					"port": "4000",
					"path": [
						"users",
						"details"
					]
				}
			},
			"response": []
		},
		{
			"name": "AddCourse",
			"request": {
				"auth": {
					"type": "bearer",
					"bearer": [
						{
							"key": "token",
							"value": "eyJhbGciOiJIUzI1NiIsInR5cCI6IkpXVCJ9.eyJpZCI6IjYzYzkzODA1NTNkMTVmYmYxOWVlMmY2ZiIsImVtYWlsIjoiamVyb21lQG1haWwuY29tIiwiaXNBZG1pbiI6dHJ1ZSwiaWF0IjoxNjc0MjE3NTU3fQ.FRyMOymTlkPa-cSlqg7waI-iFW6Nznnjfbdv4cj-13Q",
							"type": "string"
						}
					]
				},
				"method": "POST",
				"header": [],
				"body": {
					"mode": "raw",
					"raw": "{\r\n    \"name\": \"CSS\",\r\n    \"description\" : \"Add styles on your website\",\r\n    \"price\": 1000\r\n}",
					"options": {
						"raw": {
							"language": "json"
						}
					}
				},
				"url": {
					"raw": "localhost:4000/courses",
					"host": [
						"localhost"
					],
					"port": "4000",
					"path": [
						"courses"
					]
				}
			},
			"response": []
		},
		{
			"name": "Check all Courses",
			"request": {
				"method": "GET",
				"header": [],
				"url": {
					"raw": "localhost:4000/courses/allCourses",
					"host": [
						"localhost"
					],
					"port": "4000",
					"path": [
						"courses",
						"allCourses"
					]
				}
			},
			"response": []
		},
		{
			"name": "Active Courses",
			"request": {
				"method": "GET",
				"header": [],
				"url": {
					"raw": "localhost:4000/courses",
					"host": [
						"localhost"
					],
					"port": "4000",
					"path": [
						"courses"
					]
				}
			},
			"response": []
		},
		{
			"name": "get Specific Course",
			"request": {
				"method": "GET",
				"header": [],
				"url": {
					"raw": "localhost:4000/courses/63ca8892cb68cd45508c75eb",
					"host": [
						"localhost"
					],
					"port": "4000",
					"path": [
						"courses",
						"63ca8892cb68cd45508c75eb"
					]
				}
			},
			"response": []
		},
		{
			"name": "update a course",
			"request": {
				"auth": {
					"type": "bearer",
					"bearer": [
						{
							"key": "token",
							"value": "eyJhbGciOiJIUzI1NiIsInR5cCI6IkpXVCJ9.eyJpZCI6IjYzYzkzODA1NTNkMTVmYmYxOWVlMmY2ZiIsImVtYWlsIjoiamVyb21lQG1haWwuY29tIiwiaXNBZG1pbiI6dHJ1ZSwiaWF0IjoxNjc0NDY3NTMxfQ.CydFcrL1IfcywpRa8s3GNmI5wtB3zfCgmBqPcJ059tE",
							"type": "string"
						}
					]
				},
				"method": "PUT",
				"header": [],
				"body": {
					"mode": "raw",
					"raw": "{\r\n    \"name\": \"JavaScript\",\r\n    \"description\" : \"Making websites dynamic since the 90's\",\r\n    \"price\": 5000\r\n}",
					"options": {
						"raw": {
							"language": "json"
						}
					}
				},
				"url": {
					"raw": "localhost:4000/courses/63ca728fed27ca53f62d098f",
					"host": [
						"localhost"
					],
					"port": "4000",
					"path": [
						"courses",
						"63ca728fed27ca53f62d098f"
					]
				}
			},
			"response": []
		},
		{
			"name": "Archive a post",
			"request": {
				"auth": {
					"type": "bearer",
					"bearer": [
						{
							"key": "token",
							"value": "eyJhbGciOiJIUzI1NiIsInR5cCI6IkpXVCJ9.eyJpZCI6IjYzYzdlZjBjOWJlMjg5NzUwMGM0YTQ5ZSIsImVtYWlsIjoiam9obkBtYWlsLmNvbSIsImlzQWRtaW4iOmZhbHNlLCJpYXQiOjE2NzQ0NzY2ODB9.nYOym_HpAkhnq43QN2mfnAZk0KIqFakBNDhRHFCF5EQ",
							"type": "string"
						}
					]
				},
				"method": "PATCH",
				"header": [],
				"body": {
					"mode": "raw",
					"raw": "{\r\n    \"isActive\": \"true\"\r\n}",
					"options": {
						"raw": {
							"language": "json"
						}
					}
				},
				"url": {
					"raw": "localhost:4000/courses/63ca728fed27ca53f62d098f/archive",
					"host": [
						"localhost"
					],
					"port": "4000",
					"path": [
						"courses",
						"63ca728fed27ca53f62d098f",
						"archive"
					]
				}
			},
			"response": []
		},
		{
			"name": "Enroll a user",
			"request": {
				"auth": {
					"type": "bearer",
					"bearer": [
						{
							"key": "token",
							"value": "eyJhbGciOiJIUzI1NiIsInR5cCI6IkpXVCJ9.eyJpZCI6IjYzYzdlZjBjOWJlMjg5NzUwMGM0YTQ5ZSIsImVtYWlsIjoiam9obkBtYWlsLmNvbSIsImlzQWRtaW4iOmZhbHNlLCJpYXQiOjE2NzQ0Nzk2MTR9.G88I99m1Y9AEbembvqF1b7dHTJkfwv5GAS9RSGitsbQ",
							"type": "string"
						}
					]
				},
				"method": "POST",
				"header": [],
				"body": {
					"mode": "raw",
					"raw": "{\r\n    \"courseId\" : \"63ca63712d456677a37bdae3\"\r\n}",
					"options": {
						"raw": {
							"language": "json"
						}
					}
				},
				"url": {
					"raw": "localhost:4000/users/enroll",
					"host": [
						"localhost"
					],
					"port": "4000",
					"path": [
						"users",
						"enroll"
					]
				}
			},
			"response": []
		}
	]
}