{
	"info": {
		"_postman_id": "4d89feec-9ae2-4648-b0ec-cb3f7d0a0c1a",
		"name": "b244 Course Booking",
		"schema": "https://schema.getpostman.com/json/collection/v2.1.0/collection.json",
		"_exporter_id": "24272214"
	},
	"item": [
		{
			"name": "Check email",
			"request": {
				"method": "POST",
				"header": [],
				"body": {
					"mode": "raw",
					"raw": "{\r\n    \"email\" : \"john@mail.com\"\r\n}",
					"options": {
						"raw": {
							"language": "json"
						}
					}
				},
				"url": {
					"raw": "http://localhost:4000/users/checkEmail",
					"protocol": "http",
					"host": [
						"localhost"
					],
					"port": "4000",
					"path": [
						"users",
						"checkEmail"
					]
				}
			},
			"response": []
		},
		{
			"name": "User registration",
			"request": {
				"method": "POST",
				"header": [],
				"body": {
					"mode": "raw",
					"raw": "{\r\n    \"firstName\" : \"John\",\r\n    \"lastName\" : \"Smith\",\r\n    \"email\" : \"john@mail.com\",\r\n    \"mobileNo\" : \"09123456789\",\r\n    \"password\": \"john1234\"\r\n}",
					"options": {
						"raw": {
							"language": "json"
						}
					}
				},
				"url": {
					"raw": "http://localhost:4000/users/register",
					"protocol": "http",
					"host": [
						"localhost"
					],
					"port": "4000",
					"path": [
						"users",
						"register"
					]
				}
			},
			"response": []
		},
		{
			"name": "User login",
			"request": {
				"method": "POST",
				"header": [],
				"body": {
					"mode": "raw",
					"raw": "{\r\n    \"email\" : \"john@mail.com\",\r\n    \"password\" : \"john1234\"\r\n}",
					"options": {
						"raw": {
							"language": "json"
						}
					}
				},
				"url": {
					"raw": "http://localhost:4000/users/login",
					"protocol": "http",
					"host": [
						"localhost"
					],
					"port": "4000",
					"path": [
						"users",
						"login"
					]
				}
			},
			"response": []
		},
		{
			"name": "Get user details",
			"protocolProfileBehavior": {
				"disableBodyPruning": true
			},
			"request": {
				"auth": {
					"type": "bearer",
					"bearer": [
						{
							"key": "token",
							"value": "eyJhbGciOiJIUzI1NiIsInR5cCI6IkpXVCJ9.eyJpZCI6IjYzYzkzMmQ5M2QyOWUwYTBlOGJjZGExMyIsImVtYWlsIjoiam9obkBtYWlsLmNvbSIsImlzQWRtaW4iOmZhbHNlLCJpYXQiOjE2NzQ1Mzc5NDl9.qji0hEK_aezQ8UTacCx16Hkd2MHTSj86t-U-rkaUa44",
							"type": "string"
						}
					]
				},
				"method": "GET",
				"header": [],
				"body": {
					"mode": "raw",
					"raw": "",
					"options": {
						"raw": {
							"language": "json"
						}
					}
				},
				"url": {
					"raw": "http://localhost:4000/users/details",
					"protocol": "http",
					"host": [
						"localhost"
					],
					"port": "4000",
					"path": [
						"users",
						"details"
					]
				}
			},
			"response": []
		},
		{
			"name": "Add coruse",
			"request": {
				"auth": {
					"type": "bearer",
					"bearer": [
						{
							"key": "token",
							"value": "eyJhbGciOiJIUzI1NiIsInR5cCI6IkpXVCJ9.eyJpZCI6IjYzY2E2YjdjNzc4NjYzMDAxMmFhZjk3NSIsImVtYWlsIjoibWF0dEBtYWlsLmNvbSIsImlzQWRtaW4iOnRydWUsImlhdCI6MTY3NDIxNzUxMX0._ndfTowcktwk0NGGHhrHvjk12Fn8JzmvnAZoFkq5P9Q",
							"type": "string"
						}
					]
				},
				"method": "POST",
				"header": [],
				"body": {
					"mode": "raw",
					"raw": "{\r\n    \"name\" : \"CSS\",\r\n    \"description\" : \"Make your website attractive\",\r\n    \"price\" : \"1000\"\r\n}",
					"options": {
						"raw": {
							"language": "json"
						}
					}
				},
				"url": {
					"raw": "http://localhost:4000/courses",
					"protocol": "http",
					"host": [
						"localhost"
					],
					"port": "4000",
					"path": [
						"courses"
					]
				}
			},
			"response": []
		},
		{
			"name": "Get all courses",
			"request": {
				"method": "GET",
				"header": [],
				"url": {
					"raw": "http://localhost:4000/courses/allCourses",
					"protocol": "http",
					"host": [
						"localhost"
					],
					"port": "4000",
					"path": [
						"courses",
						"allCourses"
					]
				}
			},
			"response": []
		},
		{
			"name": "Get all active courses",
			"request": {
				"method": "GET",
				"header": [],
				"url": {
					"raw": "http://localhost:4000/courses",
					"protocol": "http",
					"host": [
						"localhost"
					],
					"port": "4000",
					"path": [
						"courses"
					]
				}
			},
			"response": []
		},
		{
			"name": "s",
			"request": {
				"method": "GET",
				"header": [],
				"url": {
					"raw": "http://localhost:4000/courses/63ca883368fd90d76cc1710e",
					"protocol": "http",
					"host": [
						"localhost"
					],
					"port": "4000",
					"path": [
						"courses",
						"63ca883368fd90d76cc1710e"
					]
				}
			},
			"response": []
		},
		{
			"name": "Update a course",
			"request": {
				"auth": {
					"type": "bearer",
					"bearer": [
						{
							"key": "token",
							"value": "eyJhbGciOiJIUzI1NiIsInR5cCI6IkpXVCJ9.eyJpZCI6IjYzY2E2YjdjNzc4NjYzMDAxMmFhZjk3NSIsImVtYWlsIjoibWF0dEBtYWlsLmNvbSIsImlzQWRtaW4iOnRydWUsImlhdCI6MTY3NDQ2NzUxMX0.4Fphx1KUCmB9w0QANIdr39H_Mr1BWwcIoTTe_zGKK20",
							"type": "string"
						}
					]
				},
				"method": "PUT",
				"header": [],
				"body": {
					"mode": "raw",
					"raw": "{\r\n    \"name\" : \"JavaScript\",\r\n    \"description\" : \"Taking websites dynamic since the 90's\",\r\n    \"price\" : 2000\r\n}",
					"options": {
						"raw": {
							"language": "json"
						}
					}
				},
				"url": {
					"raw": "http://localhost:4000/courses/63ca719c0798d2091272d82e",
					"protocol": "http",
					"host": [
						"localhost"
					],
					"port": "4000",
					"path": [
						"courses",
						"63ca719c0798d2091272d82e"
					]
				}
			},
			"response": []
		},
		{
			"name": "Archive a course",
			"request": {
				"auth": {
					"type": "bearer",
					"bearer": [
						{
							"key": "token",
							"value": "eyJhbGciOiJIUzI1NiIsInR5cCI6IkpXVCJ9.eyJpZCI6IjYzY2E2YjdjNzc4NjYzMDAxMmFhZjk3NSIsImVtYWlsIjoibWF0dEBtYWlsLmNvbSIsImlzQWRtaW4iOnRydWUsImlhdCI6MTY3NDQ2NzUxMX0.4Fphx1KUCmB9w0QANIdr39H_Mr1BWwcIoTTe_zGKK20",
							"type": "string"
						}
					]
				},
				"method": "PATCH",
				"header": [],
				"body": {
					"mode": "raw",
					"raw": "{\r\n    \"isActive\" : false\r\n}",
					"options": {
						"raw": {
							"language": "json"
						}
					}
				},
				"url": {
					"raw": "http://localhost:4000/courses/63c94acf382e839ab62d3c09/archive",
					"protocol": "http",
					"host": [
						"localhost"
					],
					"port": "4000",
					"path": [
						"courses",
						"63c94acf382e839ab62d3c09",
						"archive"
					]
				}
			},
			"response": []
		},
		{
			"name": "Enroll a user",
			"request": {
				"auth": {
					"type": "bearer",
					"bearer": [
						{
							"key": "token",
							"value": "eyJhbGciOiJIUzI1NiIsInR5cCI6IkpXVCJ9.eyJpZCI6IjYzYzkzMmQ5M2QyOWUwYTBlOGJjZGExMyIsImVtYWlsIjoiam9obkBtYWlsLmNvbSIsImlzQWRtaW4iOmZhbHNlLCJpYXQiOjE2NzQ1NDEyODJ9.LhH47H46qCgzkPZRWIQkIFbEwpE-o91g2A8iU2PPHjM",
							"type": "string"
						}
					]
				},
				"method": "POST",
				"header": [],
				"body": {
					"mode": "raw",
					"raw": "{\r\n    \"courseId\" : \"63ca883368fd90d76cc1710e\"\r\n}",
					"options": {
						"raw": {
							"language": "json"
						}
					}
				},
				"url": {
					"raw": "http://localhost:4000/users/enroll",
					"protocol": "http",
					"host": [
						"localhost"
					],
					"port": "4000",
					"path": [
						"users",
						"enroll"
					]
				}
			},
			"response": []
		}
	]
}