{
	"info": {
		"_postman_id": "d18cee83-b568-4815-af08-976eb89ed687",
		"name": "s35 activity",
		"schema": "https://schema.getpostman.com/json/collection/v2.1.0/collection.json",
		"_exporter_id": "24272214"
	},
	"item": [
		{
			"name": "Register a user",
			"request": {
				"method": "POST",
				"header": []
			},
			"response": []
		}
	]
}