{
	"info": {
		"_postman_id": "2cd262fb-9637-482e-a77d-020694da8988",
		"name": "activity s32",
		"schema": "https://schema.getpostman.com/json/collection/v2.1.0/collection.json",
		"_exporter_id": "25264959"
	},
	"item": [
		{
			"name": "booking system",
			"request": {
				"method": "GET",
				"header": []
			},
			"response": []
		}
	]
}