{
	"info": {
		"_postman_id": "62e40ee9-f175-4f3d-b4d5-36c5d15b7fb0",
		"name": "EcommerceAPI",
		"schema": "https://schema.getpostman.com/json/collection/v2.1.0/collection.json",
		"_exporter_id": "24269212"
	},
	"item": [
		{
			"name": "Users/Admin",
			"item": [
				{
					"name": "Register user",
					"request": {
						"method": "POST",
						"header": [],
						"body": {
							"mode": "raw",
							"raw": "{\r\n    \"firstName\" : \"Admin\",\r\n    \"lastName\" : \"is Trator\",\r\n    \"username\" : \"admin\",\r\n    \"email\" : \"admin@mail.com\",\r\n    \"password\" : \"1234\",\r\n    \"mobileNo\" : \"1111\"\r\n}",
							"options": {
								"raw": {
									"language": "json"
								}
							}
						},
						"url": {
							"raw": "http://localhost:3001/api/user/register",
							"protocol": "http",
							"host": [
								"localhost"
							],
							"port": "3001",
							"path": [
								"api",
								"user",
								"register"
							]
						}
					},
					"response": []
				},
				{
					"name": "Login user/admin",
					"request": {
						"method": "POST",
						"header": [],
						"body": {
							"mode": "raw",
							"raw": "{\r\n    \"username\" : \"admin\",\r\n    \"password\" : \"1234\"\r\n}",
							"options": {
								"raw": {
									"language": "json"
								}
							}
						},
						"url": {
							"raw": "http://localhost:3001/api/user/login",
							"protocol": "http",
							"host": [
								"localhost"
							],
							"port": "3001",
							"path": [
								"api",
								"user",
								"login"
							]
						}
					},
					"response": []
				},
				{
					"name": "Update user role",
					"request": {
						"auth": {
							"type": "bearer",
							"bearer": [
								{
									"key": "token",
									"value": "eyJhbGciOiJIUzI1NiIsInR5cCI6IkpXVCJ9.eyJpZCI6IjYzOTI5MWE5ZDM5MDhhMGI2OTQ2ZTg0YSIsImVtYWlsIjoiYWRtaW5AbWFpbC5jb20iLCJpc0FkbWluIjp0cnVlLCJpYXQiOjE2NzA1NTAwMjh9.EUdqan-yTRLdjqXOU5vgMR6i5fCTFRTMC64OCLgS5zA",
									"type": "string"
								}
							]
						},
						"method": "PATCH",
						"header": [],
						"url": {
							"raw": "http://localhost:3001/api/user/update-role/63929078d3908a0b6946e832",
							"protocol": "http",
							"host": [
								"localhost"
							],
							"port": "3001",
							"path": [
								"api",
								"user",
								"update-role",
								"63929078d3908a0b6946e832"
							]
						}
					},
					"response": []
				}
			]
		},
		{
			"name": "Products",
			"item": [
				{
					"name": "Create product",
					"request": {
						"auth": {
							"type": "bearer",
							"bearer": [
								{
									"key": "token",
									"value": "eyJhbGciOiJIUzI1NiIsInR5cCI6IkpXVCJ9.eyJpZCI6IjYzOTI5MWE5ZDM5MDhhMGI2OTQ2ZTg0YSIsImVtYWlsIjoiYWRtaW5AbWFpbC5jb20iLCJpc0FkbWluIjp0cnVlLCJpYXQiOjE2NzA1NTAzMzF9.iLOiRPlko6k6kvKlGxKtJLJO3fFL0_8rfpcPcKPASgc",
									"type": "string"
								}
							]
						},
						"method": "POST",
						"header": [],
						"body": {
							"mode": "raw",
							"raw": "{\r\n    \"title\" : \"Candy Bong\",\r\n    \"description\" : \"Lightstick\",\r\n    \"price\" : 5000,\r\n    \"stock\" : 500\r\n}",
							"options": {
								"raw": {
									"language": "json"
								}
							}
						},
						"url": {
							"raw": "http://localhost:3001/api/products/add-to-inventory",
							"protocol": "http",
							"host": [
								"localhost"
							],
							"port": "3001",
							"path": [
								"api",
								"products",
								"add-to-inventory"
							]
						}
					},
					"response": []
				},
				{
					"name": "Retrieve ALL products",
					"request": {
						"auth": {
							"type": "bearer",
							"bearer": [
								{
									"key": "token",
									"value": "eyJhbGciOiJIUzI1NiIsInR5cCI6IkpXVCJ9.eyJpZCI6IjYzOTI5MWE5ZDM5MDhhMGI2OTQ2ZTg0YSIsImVtYWlsIjoiYWRtaW5AbWFpbC5jb20iLCJpc0FkbWluIjp0cnVlLCJpYXQiOjE2NzA1NTAzMzF9.iLOiRPlko6k6kvKlGxKtJLJO3fFL0_8rfpcPcKPASgc",
									"type": "string"
								}
							]
						},
						"method": "GET",
						"header": [],
						"url": {
							"raw": "http://localhost:3001/api/products/all-products",
							"protocol": "http",
							"host": [
								"localhost"
							],
							"port": "3001",
							"path": [
								"api",
								"products",
								"all-products"
							]
						}
					},
					"response": []
				},
				{
					"name": "Retrieve SINGLE product",
					"request": {
						"method": "GET",
						"header": [],
						"url": {
							"raw": "http://localhost:3001/api/products/639294be71d48ace3712d7a6",
							"protocol": "http",
							"host": [
								"localhost"
							],
							"port": "3001",
							"path": [
								"api",
								"products",
								"639294be71d48ace3712d7a6"
							]
						}
					},
					"response": []
				},
				{
					"name": "Retrieve ACTIVE products",
					"request": {
						"method": "GET",
						"header": [],
						"url": {
							"raw": "http://localhost:3001/api/products/on-stock",
							"protocol": "http",
							"host": [
								"localhost"
							],
							"port": "3001",
							"path": [
								"api",
								"products",
								"on-stock"
							]
						}
					},
					"response": []
				},
				{
					"name": "Update product",
					"request": {
						"auth": {
							"type": "bearer",
							"bearer": [
								{
									"key": "token",
									"value": "eyJhbGciOiJIUzI1NiIsInR5cCI6IkpXVCJ9.eyJpZCI6IjYzOTI5MWE5ZDM5MDhhMGI2OTQ2ZTg0YSIsImVtYWlsIjoiYWRtaW5AbWFpbC5jb20iLCJpc0FkbWluIjp0cnVlLCJpYXQiOjE2NzA1NTAzMzF9.iLOiRPlko6k6kvKlGxKtJLJO3fFL0_8rfpcPcKPASgc",
									"type": "string"
								}
							]
						},
						"method": "PUT",
						"header": [],
						"body": {
							"mode": "raw",
							"raw": "{\r\n    \"title\" : \"Candy Bong Z\",\r\n    \"price\" : 6000,\r\n    \"stock\" : 400\r\n}",
							"options": {
								"raw": {
									"language": "json"
								}
							}
						},
						"url": {
							"raw": "http://localhost:3001/api/products/update/639294be71d48ace3712d7a6",
							"protocol": "http",
							"host": [
								"localhost"
							],
							"port": "3001",
							"path": [
								"api",
								"products",
								"update",
								"639294be71d48ace3712d7a6"
							]
						}
					},
					"response": []
				},
				{
					"name": "Archive / Unarchive product",
					"request": {
						"auth": {
							"type": "bearer",
							"bearer": [
								{
									"key": "token",
									"value": "eyJhbGciOiJIUzI1NiIsInR5cCI6IkpXVCJ9.eyJpZCI6IjYzOTI5MWE5ZDM5MDhhMGI2OTQ2ZTg0YSIsImVtYWlsIjoiYWRtaW5AbWFpbC5jb20iLCJpc0FkbWluIjp0cnVlLCJpYXQiOjE2NzA1NTAzMzF9.iLOiRPlko6k6kvKlGxKtJLJO3fFL0_8rfpcPcKPASgc",
									"type": "string"
								}
							]
						},
						"method": "PATCH",
						"header": [],
						"url": {
							"raw": "http://localhost:3001/api/products/update/6392941671d48ace3712d796/archive",
							"protocol": "http",
							"host": [
								"localhost"
							],
							"port": "3001",
							"path": [
								"api",
								"products",
								"update",
								"6392941671d48ace3712d796",
								"archive"
							]
						}
					},
					"response": []
				}
			]
		}
	]
}