{
	"info": {
		"_postman_id": "1aaced2e-7727-4e1d-b9a9-74e7dc46182e",
		"name": "s32-Discussion",
		"schema": "https://schema.getpostman.com/json/collection/v2.1.0/collection.json",
		"_exporter_id": "24664263"
	},
	"item": [
		{
			"name": "get method",
			"request": {
				"method": "GET",
				"header": [],
				"url": {
					"raw": "http://localhost:4000/items",
					"protocol": "http",
					"host": [
						"localhost"
					],
					"port": "4000",
					"path": [
						"items"
					]
				}
			},
			"response": []
		},
		{
			"name": "post method",
			"request": {
				"method": "POST",
				"header": [],
				"url": {
					"raw": "http://localhost:4000/items",
					"protocol": "http",
					"host": [
						"localhost"
					],
					"port": "4000",
					"path": [
						"items"
					]
				}
			},
			"response": []
		},
		{
			"name": "get users",
			"request": {
				"method": "GET",
				"header": []
			},
			"response": []
		},
		{
			"name": "post users",
			"request": {
				"method": "GET",
				"header": []
			},
			"response": []
		}
	]
}