{
	"info": {
		"_postman_id": "ac58ce86-3c4c-4830-b53a-3e4570b3bb53",
		"name": "s36",
		"schema": "https://schema.getpostman.com/json/collection/v2.1.0/collection.json",
		"_exporter_id": "25717861"
	},
	"item": [
		{
			"name": "Insert task",
			"request": {
				"method": "POST",
				"header": [],
				"body": {
					"mode": "raw",
					"raw": "{\r\n    \"name\" : \"Create document\"\r\n}",
					"options": {
						"raw": {
							"language": "json"
						}
					}
				},
				"url": {
					"raw": "localhost:4000/tasks/addTask/",
					"host": [
						"localhost"
					],
					"port": "4000",
					"path": [
						"tasks",
						"addTask",
						""
					]
				}
			},
			"response": []
		},
		{
			"name": "RETRIEVE ALL TASK",
			"request": {
				"method": "GET",
				"header": [],
				"url": {
					"raw": "localhost:4000/tasks/allTasks",
					"host": [
						"localhost"
					],
					"port": "4000",
					"path": [
						"tasks",
						"allTasks"
					]
				}
			},
			"response": []
		},
		{
			"name": "Delete Task",
			"request": {
				"method": "DELETE",
				"header": [],
				"url": {
					"raw": "localhost:4000/tasks/deleteTask",
					"host": [
						"localhost"
					],
					"port": "4000",
					"path": [
						"tasks",
						"deleteTask"
					]
				}
			},
			"response": []
		},
		{
			"name": "Update name to archived",
			"request": {
				"method": "PUT",
				"header": [],
				"url": {
					"raw": "localhost:4000/tasks/63eb5b9f1b845d1692158745/archive",
					"host": [
						"localhost"
					],
					"port": "4000",
					"path": [
						"tasks",
						"63eb5b9f1b845d1692158745",
						"archive"
					]
				}
			},
			"response": []
		},
		{
			"name": "Update task name",
			"request": {
				"method": "PATCH",
				"header": [],
				"body": {
					"mode": "raw",
					"raw": "{\r\n\r\n    \"name\" : \"date\"\r\n    \r\n}",
					"options": {
						"raw": {
							"language": "json"
						}
					}
				},
				"url": {
					"raw": "localhost:4000/tasks/updateTask/63eb5b9f1b845d1692158745",
					"host": [
						"localhost"
					],
					"port": "4000",
					"path": [
						"tasks",
						"updateTask",
						"63eb5b9f1b845d1692158745"
					]
				}
			},
			"response": []
		}
	]
}