{
	"info": {
		"_postman_id": "8a90b384-74b9-4e42-a0a3-6b0f491348c9",
		"name": "s34-activity",
		"schema": "https://schema.getpostman.com/json/collection/v2.1.0/collection.json",
		"_exporter_id": "24719214"
	},
	"item": [
		{
			"name": "GET ALL ITEMS",
			"request": {
				"method": "GET",
				"header": [],
				"url": {
					"raw": "localhost:3000/items",
					"host": [
						"localhost"
					],
					"port": "3000",
					"path": [
						"items"
					]
				}
			},
			"response": []
		},
		{
			"name": "CREATE ITEM",
			"request": {
				"method": "POST",
				"header": [],
				"body": {
					"mode": "raw",
					"raw": "{\n    \"name\" : \"Infinity Stones\",\n    \"price\" : 90000,\n    \"isActive\" : true\n}",
					"options": {
						"raw": {
							"language": "json"
						}
					}
				},
				"url": {
					"raw": "localhost:3000/items",
					"host": [
						"localhost"
					],
					"port": "3000",
					"path": [
						"items"
					]
				}
			},
			"response": []
		},
		{
			"name": "UPDATE ITEM",
			"request": {
				"method": "PUT",
				"header": [],
				"body": {
					"mode": "raw",
					"raw": "{\n    \"price\" : 80000\n}",
					"options": {
						"raw": {
							"language": "json"
						}
					}
				},
				"url": {
					"raw": "localhost:3000/items/0",
					"host": [
						"localhost"
					],
					"port": "3000",
					"path": [
						"items",
						"0"
					]
				}
			},
			"response": []
		}
	]
}