{
	"_id" : "d2ebd9ae-a15f-11ed-a8fc-0242ac120002",
	"firstName" : "Cirilla",
	"lastName" : "Riannon",
	"email" : "ciri@mail.com",
	"password" : "c!r!",
	"isAdmin" : false,
	"mobileNumber" : "09271231234"
}


{
	"_id" : "d2ebde36-a15f-11ed-a8fc-0242ac120002",
	"firstName" : "Beth",
	"lastName" : "Harmon",
	"email" : "bharmon@mail.com",
	"password" : "ch3ss",
	"isAdmin" : true,
	"mobileNumber" : "09273214321"
}