
{
    "_id" : "user001",
    "firstName" : "Jesus",
    "lastName" : "Christ",
    "email" : "jesuschrist@heaven.com",
    "password" : "allmightygod",
    "isAdmin" : true,
    "mobileNumber" : "09229111111"
}

{
    "_id" : "user002",
    "firstName" : "John",
    "lastName" : "Smith",
    "email" : "johnsmith@mail.com",
    "password" : "johnhandsome",
    "isAdmin" : false,
    "mobileNumber" : "09221231234"
}

{
    "_id" : "user003",
    "firstName" : "Jane",
    "lastName" : "Doe",
    "email" : "janedoe@mail.com",
    "password" : "janepretty",
    "isAdmin" : false,
    "mobileNumber" : "09221234567"
}
