{
	"_id" : "507f1f77bcf86cd799439011",
	"firstName" : "John",
	"lastName" : "Smith",
	"email" : "johnsmith@mail.com",
	"password" : "johnhandsome",
	"isAdmin" : false,
	"mobileNumber" : "09221231234",
	"enrollments" : ["601ccc169bcd482ee8fa2c9a", "507f191e810c19729de860ea"],
	"datetimeRegistered" : "2022-03-15T15:00:00.00Z"
}

{
	"_id" : "506g1fg7bcf8xcd7f9439022",
	"firstName" : "Jane",
	"lastName" : "Doe",
	"email" : "janedoe@zuitt.com",
	"password" : "IamJaneDoe",
	"isAdmin" : true,
	"mobileNumber" : "09277365528",
	"enrollments" : [],
	"datetimeRegistered" : "2022-03-15T18:00:00.00Z"
}