{
	"info": {
		"_postman_id": "5ee6ffa8-ab50-4f5c-9f11-90bace59c516",
		"name": "s36 - Activity",
		"schema": "https://schema.getpostman.com/json/collection/v2.1.0/collection.json",
		"_exporter_id": "25717703"
	},
	"item": [
		{
			"name": "GET specific task",
			"request": {
				"method": "GET",
				"header": [],
				"url": {
					"raw": "localhost:4000/tasks/63ea323cf375601d64eea3cc",
					"host": [
						"localhost"
					],
					"port": "4000",
					"path": [
						"tasks",
						"63ea323cf375601d64eea3cc"
					]
				}
			},
			"response": []
		},
		{
			"name": "UPDATE status of task",
			"request": {
				"method": "PUT",
				"header": [],
				"body": {
					"mode": "raw",
					"raw": "",
					"options": {
						"raw": {
							"language": "json"
						}
					}
				},
				"url": {
					"raw": "localhost:4000/tasks/63ea323cf375601d64eea3cc/completed",
					"host": [
						"localhost"
					],
					"port": "4000",
					"path": [
						"tasks",
						"63ea323cf375601d64eea3cc",
						"completed"
					]
				}
			},
			"response": []
		}
	]
}