{
	"_id" : "6062a8eb834de22e84600edd",
	"userId" : "507f1f77bcf86cd799439011",
	"courseID" : "601ccc169bcd482ee8fa2c9a",
	"isPaid" : true,
	"paymentMethod" : "Crypto",
	"dateTimeCreated" : "2022-05-12T15:00:00.00Z"
}
{

	"_id" : "603e10d3b30fd23b081a94eb",
	"userId" : "507f1f77bcf86cd799439011",
	"courseID" : "507f191e810c19729de860ea",
	"isPaid" : true,
	"paymentMethod" : "Sibuyas coin",
	"dateTimeCreated" : "2022-05-12T15:00:00.00Z"
}