{
	"User_Id": "131202301MackCustomer",
    "FirstName" : "Mark",
    "LastName" : "Ejercito",
    "Email": "markejercito@gmail.com",
    "Password": "@***123",
    "IsAdmin" : false,
    "Mobile Number": "639-2167-51132"
}

