{
    "productID" : "product1",
    "name" : "Sibuyas",
    "description" : "Kilo of sibuyas",
    "price" : 800,
    "stocks" : 20,
    "isActive" : true
    
}

{
    "productID" : "product2",
    "name" : "Bawang",
    "description" : "Kilo of bawang",
    "price" : 40,
    "stocks" : 23,
    "isActive" : true  
   
}