{
  "_id": "507f1f77bcf86cd799439011",
  "TransactionDate": "2022-02-01T15:00:00.00Z",
  "Status": "Pending",
  "Total": 1

}

{
  "_id": "507f1f77bcf86cd799439012",
  "TransactionDate": "2022-02-01T15:00:00.00Z",
  "Status": "In Transit",
  "Total": 1

}