{
	"info": {
		"_postman_id": "656d32c3-dad2-45e3-8165-74e1e18f3d8f",
		"name": "Capstone2-Delizo",
		"schema": "https://schema.getpostman.com/json/collection/v2.1.0/collection.json",
		"_exporter_id": "16296390"
	},
	"item": [
		{
			"name": "Users",
			"item": [
				{
					"name": "user registration",
					"request": {
						"method": "POST",
						"header": [],
						"body": {
							"mode": "raw",
							"raw": "{\r\n    \"firstName\": \"jessa\",\r\n    \"lastName\": \"delizo\",\r\n    \"email\": \"jessa@gmail.com\",\r\n    \"password\": \"p@ssword123\",\r\n    \"mobileNo\": \"09995705909\",\r\n    \"address\": \"Hamilton Bermuda\"\r\n}",
							"options": {
								"raw": {
									"language": "json"
								}
							}
						},
						"url": {
							"raw": "localhost:3001/users/register",
							"host": [
								"localhost"
							],
							"port": "3001",
							"path": [
								"users",
								"register"
							]
						}
					},
					"response": []
				},
				{
					"name": "user login",
					"request": {
						"method": "POST",
						"header": [],
						"body": {
							"mode": "raw",
							"raw": "{\r\n    \"email\": \"leo@gmail.com\",\r\n    \"password\": \"p@ssword123\"\r\n}",
							"options": {
								"raw": {
									"language": "json"
								}
							}
						},
						"url": {
							"raw": "localhost:3001/users/login",
							"host": [
								"localhost"
							],
							"port": "3001",
							"path": [
								"users",
								"login"
							]
						}
					},
					"response": []
				},
				{
					"name": "user profile",
					"request": {
						"auth": {
							"type": "bearer",
							"bearer": [
								{
									"key": "token",
									"value": "eyJhbGciOiJIUzI1NiIsInR5cCI6IkpXVCJ9.eyJpZCI6IjYzNjRkZDBjMWQyNTkzNTU5YzZkNjM5MyIsImVtYWlsIjoiZGV4QGdtYWlsLmNvbSIsImlzQWRtaW4iOmZhbHNlLCJpYXQiOjE2Njc1NTQ4OTF9._idvEQTPwAqPEUfE5E6D_bH_rigWTl-DYYfZqega39Q",
									"type": "string"
								}
							]
						},
						"method": "GET",
						"header": [],
						"url": {
							"raw": "localhost:3001/users/me",
							"host": [
								"localhost"
							],
							"port": "3001",
							"path": [
								"users",
								"me"
							]
						}
					},
					"response": []
				},
				{
					"name": "user orders",
					"request": {
						"auth": {
							"type": "bearer",
							"bearer": [
								{
									"key": "token",
									"value": "eyJhbGciOiJIUzI1NiIsInR5cCI6IkpXVCJ9.eyJpZCI6IjYzNjUwZjYwM2UwMDQwOTU1MTg3ZmFhYiIsImVtYWlsIjoiY2xhaXJlQGdtYWlsLmNvbSIsImlzQWRtaW4iOmZhbHNlLCJpYXQiOjE2Njc1Njc0NjF9.E0XBx-pzhwh2Q1ajqFZUNy2O9AXMwVr8CPZqFt7J46s",
									"type": "string"
								}
							]
						},
						"method": "GET",
						"header": [],
						"url": {
							"raw": "localhost:3001/users/order",
							"host": [
								"localhost"
							],
							"port": "3001",
							"path": [
								"users",
								"order"
							]
						}
					},
					"response": []
				},
				{
					"name": "user update profile",
					"request": {
						"auth": {
							"type": "bearer",
							"bearer": [
								{
									"key": "token",
									"value": "eyJhbGciOiJIUzI1NiIsInR5cCI6IkpXVCJ9.eyJpZCI6IjYzNjRkZDBjMWQyNTkzNTU5YzZkNjM5MyIsImVtYWlsIjoiZGV4QGdtYWlsLmNvbSIsImlzQWRtaW4iOmZhbHNlLCJpYXQiOjE2Njc1NTQ1ODV9.RyxGCJKA4Ylo0mUfz5et2ESM3FjSc3j__-_Xy5MdS6U",
									"type": "string"
								}
							]
						},
						"method": "PATCH",
						"header": [],
						"body": {
							"mode": "raw",
							"raw": "{\r\n    \"address\" : \"Bermuda Island\"\r\n}",
							"options": {
								"raw": {
									"language": "json"
								}
							}
						},
						"url": {
							"raw": "localhost:3001/users/update/me",
							"host": [
								"localhost"
							],
							"port": "3001",
							"path": [
								"users",
								"update",
								"me"
							]
						}
					},
					"response": []
				},
				{
					"name": "user update password",
					"request": {
						"auth": {
							"type": "bearer",
							"bearer": [
								{
									"key": "token",
									"value": "eyJhbGciOiJIUzI1NiIsInR5cCI6IkpXVCJ9.eyJpZCI6IjYzNjRkZDBjMWQyNTkzNTU5YzZkNjM5MyIsImVtYWlsIjoiZGV4QGdtYWlsLmNvbSIsImlzQWRtaW4iOmZhbHNlLCJpYXQiOjE2Njc1NTU2NzJ9.aLs4j83yIqjZGo1ofTEX7qY9AhxjgZNUaQppTDm5PCg",
									"type": "string"
								}
							]
						},
						"method": "PATCH",
						"header": [],
						"body": {
							"mode": "raw",
							"raw": "{\r\n    \"password\" : \"p@ssword1\"\r\n}",
							"options": {
								"raw": {
									"language": "json"
								}
							}
						},
						"url": {
							"raw": "localhost:3001/users/update/password",
							"host": [
								"localhost"
							],
							"port": "3001",
							"path": [
								"users",
								"update",
								"password"
							]
						}
					},
					"response": []
				},
				{
					"name": "user admin all user",
					"request": {
						"auth": {
							"type": "bearer",
							"bearer": [
								{
									"key": "token",
									"value": "eyJhbGciOiJIUzI1NiIsInR5cCI6IkpXVCJ9.eyJpZCI6IjYzNjRjYWQ0M2U5M2Q0YTBkZTMyMGNhZiIsImVtYWlsIjoiamFuZUBnbWFpbC5jb20iLCJpc0FkbWluIjp0cnVlLCJpYXQiOjE2Njc1NTYxMTZ9.OkJUK2wEdERPuvoP3PY49MDSruVE68YUyp6Btgt-h2g",
									"type": "string"
								}
							]
						},
						"method": "GET",
						"header": [],
						"url": {
							"raw": "localhost:3001/users/all",
							"host": [
								"localhost"
							],
							"port": "3001",
							"path": [
								"users",
								"all"
							]
						}
					},
					"response": []
				},
				{
					"name": "user admin edit user profile",
					"request": {
						"auth": {
							"type": "bearer",
							"bearer": [
								{
									"key": "token",
									"value": "eyJhbGciOiJIUzI1NiIsInR5cCI6IkpXVCJ9.eyJpZCI6IjYzNjRjYWQ0M2U5M2Q0YTBkZTMyMGNhZiIsImVtYWlsIjoiamFuZUBnbWFpbC5jb20iLCJpc0FkbWluIjp0cnVlLCJpYXQiOjE2Njc1NTQ0NDl9.dZG9uMNhMRQ6C03NNL4TVMx2mLFixuf9KdaNQ53l4jo",
									"type": "string"
								}
							]
						},
						"method": "PATCH",
						"header": [],
						"body": {
							"mode": "raw",
							"raw": "{\r\n    \"address\" : \"Tondo Manila \"\r\n}",
							"options": {
								"raw": {
									"language": "json"
								}
							}
						},
						"url": {
							"raw": "localhost:3001/users/6364dd0c1d2593559c6d6393/update",
							"host": [
								"localhost"
							],
							"port": "3001",
							"path": [
								"users",
								"6364dd0c1d2593559c6d6393",
								"update"
							]
						}
					},
					"response": []
				},
				{
					"name": "Set user to Admin",
					"request": {
						"auth": {
							"type": "bearer",
							"bearer": [
								{
									"key": "token",
									"value": "eyJhbGciOiJIUzI1NiIsInR5cCI6IkpXVCJ9.eyJpZCI6IjYzNjRjYWQ0M2U5M2Q0YTBkZTMyMGNhZiIsImVtYWlsIjoiamFuZUBnbWFpbC5jb20iLCJpc0FkbWluIjp0cnVlLCJpYXQiOjE2Njc1Njg3OTR9.JURREM4royt1OP8KBlo_xNvbPC6h3lvtiEyp74T0jPY",
									"type": "string"
								}
							]
						},
						"method": "PATCH",
						"header": [],
						"url": {
							"raw": "localhost:3001/users/636514783c8fb7e8e2a81ac7/admin",
							"host": [
								"localhost"
							],
							"port": "3001",
							"path": [
								"users",
								"636514783c8fb7e8e2a81ac7",
								"admin"
							]
						}
					},
					"response": []
				}
			]
		},
		{
			"name": "Product",
			"item": [
				{
					"name": "create product",
					"request": {
						"auth": {
							"type": "bearer",
							"bearer": [
								{
									"key": "token",
									"value": "eyJhbGciOiJIUzI1NiIsInR5cCI6IkpXVCJ9.eyJpZCI6IjYzNjRjYWQ0M2U5M2Q0YTBkZTMyMGNhZiIsImVtYWlsIjoiamFuZUBnbWFpbC5jb20iLCJpc0FkbWluIjp0cnVlLCJpYXQiOjE2Njc1NTczMDd9.6omoiZ5dU6Mt351hMFiOZLxiy30jDD1fBT2VFBg80Sg",
									"type": "string"
								}
							]
						},
						"method": "POST",
						"header": [],
						"body": {
							"mode": "raw",
							"raw": " {\r\n     \"categories\": \"laptop\",\r\n     \"brand\": \"Apple\",\r\n     \"name\": \"Macbook pro max\",\r\n     \"screenSize\": \"16 Inches\",\r\n     \"cpu\": \"M2\",\r\n     \"videoCard\" : \"M2 chip video card\",\r\n     \"ram\" : \"32GB\",\r\n     \"storage\": \"1TB SSD\",\r\n     \"OS\": \"Windows 10 pro\",\r\n     \"description\": \"Premium laptop\",\r\n     \"price\" : 150000\r\n }",
							"options": {
								"raw": {
									"language": "json"
								}
							}
						},
						"url": {
							"raw": "localhost:3001/products/create",
							"host": [
								"localhost"
							],
							"port": "3001",
							"path": [
								"products",
								"create"
							]
						}
					},
					"response": []
				},
				{
					"name": "get active products",
					"request": {
						"auth": {
							"type": "bearer",
							"bearer": [
								{
									"key": "token",
									"value": "eyJhbGciOiJIUzI1NiIsInR5cCI6IkpXVCJ9.eyJpZCI6IjYzNjM4MTIxOTRjZWM1N2Y5ODkwYzExNSIsImVtYWlsIjoiamFuZUBnbWFpbC5jb20iLCJpc0FkbWluIjp0cnVlLCJpYXQiOjE2Njc0NjkwODl9.TxiWHmo1FO_z8ppB-1_reFjBFv31qGntbgnRwI5ORQQ",
									"type": "string"
								}
							]
						},
						"method": "GET",
						"header": [],
						"url": {
							"raw": "localhost:3001/products/active",
							"host": [
								"localhost"
							],
							"port": "3001",
							"path": [
								"products",
								"active"
							]
						}
					},
					"response": []
				},
				{
					"name": "get specific product",
					"request": {
						"auth": {
							"type": "bearer",
							"bearer": [
								{
									"key": "token",
									"value": "eyJhbGciOiJIUzI1NiIsInR5cCI6IkpXVCJ9.eyJpZCI6IjYzNjM4MTIxOTRjZWM1N2Y5ODkwYzExNSIsImVtYWlsIjoiamFuZUBnbWFpbC5jb20iLCJpc0FkbWluIjp0cnVlLCJpYXQiOjE2Njc0NjkwODl9.TxiWHmo1FO_z8ppB-1_reFjBFv31qGntbgnRwI5ORQQ",
									"type": "string"
								}
							]
						},
						"method": "GET",
						"header": [],
						"url": {
							"raw": "localhost:3001/products/636493781f443a0b88b4e009",
							"host": [
								"localhost"
							],
							"port": "3001",
							"path": [
								"products",
								"636493781f443a0b88b4e009"
							]
						}
					},
					"response": []
				},
				{
					"name": "update product",
					"request": {
						"auth": {
							"type": "bearer",
							"bearer": [
								{
									"key": "token",
									"value": "eyJhbGciOiJIUzI1NiIsInR5cCI6IkpXVCJ9.eyJpZCI6IjYzNjRjYWQ0M2U5M2Q0YTBkZTMyMGNhZiIsImVtYWlsIjoiamFuZUBnbWFpbC5jb20iLCJpc0FkbWluIjp0cnVlLCJpYXQiOjE2Njc1NTczMDd9.6omoiZ5dU6Mt351hMFiOZLxiy30jDD1fBT2VFBg80Sg",
									"type": "string"
								}
							]
						},
						"method": "PATCH",
						"header": [],
						"body": {
							"mode": "raw",
							"raw": "{   \r\n    \"OS\": \"Mac OS Monterey\"\r\n}",
							"options": {
								"raw": {
									"language": "json"
								}
							}
						},
						"url": {
							"raw": "localhost:3001/products/6364e948dd6eb3052732b245/update",
							"host": [
								"localhost"
							],
							"port": "3001",
							"path": [
								"products",
								"6364e948dd6eb3052732b245",
								"update"
							]
						}
					},
					"response": []
				},
				{
					"name": "archive product",
					"request": {
						"auth": {
							"type": "bearer",
							"bearer": [
								{
									"key": "token",
									"value": "eyJhbGciOiJIUzI1NiIsInR5cCI6IkpXVCJ9.eyJpZCI6IjYzNjM4MTIxOTRjZWM1N2Y5ODkwYzExNSIsImVtYWlsIjoiamFuZUBnbWFpbC5jb20iLCJpc0FkbWluIjp0cnVlLCJpYXQiOjE2Njc0ODE2Mzh9.kmVxNEUCSlUtwQdcQLFCmOl9ONmG2HVhjrZ84p0kOAo",
									"type": "string"
								}
							]
						},
						"method": "PATCH",
						"header": [],
						"body": {
							"mode": "raw",
							"raw": ""
						},
						"url": {
							"raw": "localhost:3001/products/636389f6867961370dcc1eaa/archive",
							"host": [
								"localhost"
							],
							"port": "3001",
							"path": [
								"products",
								"636389f6867961370dcc1eaa",
								"archive"
							]
						}
					},
					"response": []
				},
				{
					"name": "delete product",
					"request": {
						"auth": {
							"type": "bearer",
							"bearer": [
								{
									"key": "token",
									"value": "eyJhbGciOiJIUzI1NiIsInR5cCI6IkpXVCJ9.eyJpZCI6IjYzNjQ3ZmE4MzI0N2MyYWM1NjcwZTg5NiIsImVtYWlsIjoiamFuZUBnbWFpbC5jb20iLCJpc0FkbWluIjp0cnVlLCJpYXQiOjE2Njc1NDM1MzN9.HjTcKTSZLXo9gQLJ14v4yC87MG8lhdWkjElQySwBW1Q",
									"type": "string"
								}
							]
						},
						"method": "DELETE",
						"header": [],
						"url": {
							"raw": "localhost:3001/products/6364cb283bf740f68f07d21b/delete",
							"host": [
								"localhost"
							],
							"port": "3001",
							"path": [
								"products",
								"6364cb283bf740f68f07d21b",
								"delete"
							]
						}
					},
					"response": []
				}
			]
		},
		{
			"name": "Order",
			"item": [
				{
					"name": "order products",
					"request": {
						"auth": {
							"type": "bearer",
							"bearer": [
								{
									"key": "token",
									"value": "eyJhbGciOiJIUzI1NiIsInR5cCI6IkpXVCJ9.eyJpZCI6IjYzNjUwZjYwM2UwMDQwOTU1MTg3ZmFhYiIsImVtYWlsIjoiY2xhaXJlQGdtYWlsLmNvbSIsImlzQWRtaW4iOmZhbHNlLCJpYXQiOjE2Njc1Njc0NjF9.E0XBx-pzhwh2Q1ajqFZUNy2O9AXMwVr8CPZqFt7J46s",
									"type": "string"
								}
							]
						},
						"method": "POST",
						"header": [],
						"body": {
							"mode": "raw",
							"raw": "{\r\n    \"productId\" :\"6364e8a4dd6eb3052732b242\",\r\n    \"quantity\": 5\r\n}",
							"options": {
								"raw": {
									"language": "json"
								}
							}
						},
						"url": {
							"raw": "localhost:3001/orders/create",
							"host": [
								"localhost"
							],
							"port": "3001",
							"path": [
								"orders",
								"create"
							]
						}
					},
					"response": []
				},
				{
					"name": "all order",
					"request": {
						"auth": {
							"type": "bearer",
							"bearer": [
								{
									"key": "token",
									"value": "eyJhbGciOiJIUzI1NiIsInR5cCI6IkpXVCJ9.eyJpZCI6IjYzNjRjYWQ0M2U5M2Q0YTBkZTMyMGNhZiIsImVtYWlsIjoiamFuZUBnbWFpbC5jb20iLCJpc0FkbWluIjp0cnVlLCJpYXQiOjE2Njc1NTczMDd9.6omoiZ5dU6Mt351hMFiOZLxiy30jDD1fBT2VFBg80Sg",
									"type": "string"
								}
							]
						},
						"method": "GET",
						"header": [],
						"url": {
							"raw": "localhost:3001/orders/all",
							"host": [
								"localhost"
							],
							"port": "3001",
							"path": [
								"orders",
								"all"
							]
						}
					},
					"response": []
				}
			]
		},
		{
			"name": "Cart",
			"item": [
				{
					"name": "add to cart",
					"request": {
						"auth": {
							"type": "bearer",
							"bearer": [
								{
									"key": "token",
									"value": "eyJhbGciOiJIUzI1NiIsInR5cCI6IkpXVCJ9.eyJpZCI6IjYzNjRlNjhjN2U1Yjc2ZDA1MjU1OGU2OCIsImVtYWlsIjoibGVvQGdtYWlsLmNvbSIsImlzQWRtaW4iOmZhbHNlLCJpYXQiOjE2Njc1ODAwMjd9.g_0t6MOyWw5eLZapps9NE2PnQehPRQlNUjnTZII5zQo",
									"type": "string"
								}
							]
						},
						"method": "POST",
						"header": [],
						"body": {
							"mode": "raw",
							"raw": "{\r\n    \"productId\" : \"6364e813dd6eb3052732b236\",\r\n    \"quantity\" : 3\r\n}   ",
							"options": {
								"raw": {
									"language": "json"
								}
							}
						},
						"url": {
							"raw": "localhost:3001/carts/add",
							"host": [
								"localhost"
							],
							"port": "3001",
							"path": [
								"carts",
								"add"
							]
						}
					},
					"response": []
				},
				{
					"name": "read all  cart products",
					"request": {
						"auth": {
							"type": "bearer",
							"bearer": [
								{
									"key": "token",
									"value": "eyJhbGciOiJIUzI1NiIsInR5cCI6IkpXVCJ9.eyJpZCI6IjYzNjRlNjhjN2U1Yjc2ZDA1MjU1OGU2OCIsImVtYWlsIjoibGVvQGdtYWlsLmNvbSIsImlzQWRtaW4iOmZhbHNlLCJpYXQiOjE2Njc2MjE3NzR9.T9vZticRhMjQBlCHUiyIEMf7xz8XWcn9vBzlKrVYiFE",
									"type": "string"
								}
							]
						},
						"method": "GET",
						"header": [],
						"url": {
							"raw": "localhost:3001/carts/me",
							"host": [
								"localhost"
							],
							"port": "3001",
							"path": [
								"carts",
								"me"
							]
						}
					},
					"response": []
				},
				{
					"name": "delete order in carts",
					"request": {
						"auth": {
							"type": "bearer",
							"bearer": [
								{
									"key": "token",
									"value": "eyJhbGciOiJIUzI1NiIsInR5cCI6IkpXVCJ9.eyJpZCI6IjYzNjRlNjhjN2U1Yjc2ZDA1MjU1OGU2OCIsImVtYWlsIjoibGVvQGdtYWlsLmNvbSIsImlzQWRtaW4iOmZhbHNlLCJpYXQiOjE2Njc2MjY3NDJ9.dixpwpanJ1C9JFiaMrRxCJ5Mr-E_M6_ytG0GFs-WF7Q",
									"type": "string"
								}
							]
						},
						"method": "DELETE",
						"header": [],
						"url": {
							"raw": "localhost:3001/carts/6364e813dd6eb3052732b236/delete",
							"host": [
								"localhost"
							],
							"port": "3001",
							"path": [
								"carts",
								"6364e813dd6eb3052732b236",
								"delete"
							]
						}
					},
					"response": []
				},
				{
					"name": "edit quantity of order in carts",
					"request": {
						"auth": {
							"type": "bearer",
							"bearer": [
								{
									"key": "token",
									"value": "eyJhbGciOiJIUzI1NiIsInR5cCI6IkpXVCJ9.eyJpZCI6IjYzNjRlNjhjN2U1Yjc2ZDA1MjU1OGU2OCIsImVtYWlsIjoibGVvQGdtYWlsLmNvbSIsImlzQWRtaW4iOmZhbHNlLCJpYXQiOjE2Njc2MjY3NDJ9.dixpwpanJ1C9JFiaMrRxCJ5Mr-E_M6_ytG0GFs-WF7Q",
									"type": "string"
								}
							]
						},
						"method": "PATCH",
						"header": [],
						"body": {
							"mode": "raw",
							"raw": "{\r\n    \"quantity\" : 1\r\n}",
							"options": {
								"raw": {
									"language": "json"
								}
							}
						},
						"url": {
							"raw": "localhost:3001/carts/6364e8a4dd6eb3052732b242/update",
							"host": [
								"localhost"
							],
							"port": "3001",
							"path": [
								"carts",
								"6364e8a4dd6eb3052732b242",
								"update"
							]
						}
					},
					"response": []
				}
			]
		},
		{
			"name": "Credit Card",
			"item": []
		},
		{
			"name": "Membership Card",
			"item": []
		}
	]
}