{
	"info": {
		"_postman_id": "656d32c3-dad2-45e3-8165-74e1e18f3d8f",
		"name": "Capstone2-Delizo",
		"schema": "https://schema.getpostman.com/json/collection/v2.1.0/collection.json",
		"_exporter_id": "16296390"
	},
	"item": [
		{
			"name": "Users",
			"item": [
				{
					"name": "user registration",
					"request": {
						"method": "POST",
						"header": [],
						"body": {
							"mode": "raw",
							"raw": "{\r\n    \"firstName\": \"john\",\r\n    \"lastName\": \"smith\",\r\n    \"email\": \"john@gmail.com\",\r\n    \"password\": \"p@ssword123\",\r\n    \"mobileNo\": \"09995705507\"\r\n}",
							"options": {
								"raw": {
									"language": "json"
								}
							}
						},
						"url": {
							"raw": "localhost:3001/users/register",
							"host": [
								"localhost"
							],
							"port": "3001",
							"path": [
								"users",
								"register"
							]
						}
					},
					"response": []
				},
				{
					"name": "user login",
					"request": {
						"method": "POST",
						"header": [],
						"body": {
							"mode": "raw",
							"raw": "{\r\n    \"email\": \"jane@gmail.com\",\r\n    \"password\": \"p@ssword123\"\r\n}",
							"options": {
								"raw": {
									"language": "json"
								}
							}
						},
						"url": {
							"raw": "localhost:3001/users/login",
							"host": [
								"localhost"
							],
							"port": "3001",
							"path": [
								"users",
								"login"
							]
						}
					},
					"response": []
				},
				{
					"name": "user orders",
					"request": {
						"method": "GET",
						"header": []
					},
					"response": []
				},
				{
					"name": "user admin edit user profile",
					"request": {
						"method": "GET",
						"header": []
					},
					"response": []
				},
				{
					"name": "user admin all user",
					"request": {
						"method": "GET",
						"header": []
					},
					"response": []
				},
				{
					"name": "user update profile",
					"request": {
						"method": "PATCH",
						"header": []
					},
					"response": []
				}
			]
		},
		{
			"name": "Product",
			"item": [
				{
					"name": "create product",
					"request": {
						"auth": {
							"type": "bearer",
							"bearer": [
								{
									"key": "token",
									"value": "eyJhbGciOiJIUzI1NiIsInR5cCI6IkpXVCJ9.eyJpZCI6IjYzNjQ3ZmE4MzI0N2MyYWM1NjcwZTg5NiIsImVtYWlsIjoiamFuZUBnbWFpbC5jb20iLCJpc0FkbWluIjp0cnVlLCJpYXQiOjE2Njc1MzUxMTV9.pCPOkjZ5n4GpRFc1VAZz63ODsiRvLwnS9WroWaML8I4",
									"type": "string"
								}
							]
						},
						"method": "POST",
						"header": [],
						"body": {
							"mode": "raw",
							"raw": " {\r\n     \"categories\": \"laptop\",\r\n     \"brand\": \"acer\",\r\n     \"name\": \"Acer Helios 300\",\r\n     \"screenSize\": \"15.6 Inches\",\r\n     \"cpu\": \"Core i7\",\r\n     \"videoCard\" : \"asdasd\",\r\n     \"ram\" : \"16GB\",\r\n     \"storage\": \"256 SSD\",\r\n     \"OS\": \"Windows 10 pro\",\r\n     \"description\": \"Gaming laptop\",\r\n     \"price\": 3000\r\n }",
							"options": {
								"raw": {
									"language": "json"
								}
							}
						},
						"url": {
							"raw": "localhost:3001/products/create",
							"host": [
								"localhost"
							],
							"port": "3001",
							"path": [
								"products",
								"create"
							]
						}
					},
					"response": []
				},
				{
					"name": "get active products",
					"request": {
						"auth": {
							"type": "bearer",
							"bearer": [
								{
									"key": "token",
									"value": "eyJhbGciOiJIUzI1NiIsInR5cCI6IkpXVCJ9.eyJpZCI6IjYzNjM4MTIxOTRjZWM1N2Y5ODkwYzExNSIsImVtYWlsIjoiamFuZUBnbWFpbC5jb20iLCJpc0FkbWluIjp0cnVlLCJpYXQiOjE2Njc0NjkwODl9.TxiWHmo1FO_z8ppB-1_reFjBFv31qGntbgnRwI5ORQQ",
									"type": "string"
								}
							]
						},
						"method": "GET",
						"header": [],
						"url": {
							"raw": "localhost:3001/products/active",
							"host": [
								"localhost"
							],
							"port": "3001",
							"path": [
								"products",
								"active"
							]
						}
					},
					"response": []
				},
				{
					"name": "get specific product",
					"request": {
						"auth": {
							"type": "bearer",
							"bearer": [
								{
									"key": "token",
									"value": "eyJhbGciOiJIUzI1NiIsInR5cCI6IkpXVCJ9.eyJpZCI6IjYzNjM4MTIxOTRjZWM1N2Y5ODkwYzExNSIsImVtYWlsIjoiamFuZUBnbWFpbC5jb20iLCJpc0FkbWluIjp0cnVlLCJpYXQiOjE2Njc0NjkwODl9.TxiWHmo1FO_z8ppB-1_reFjBFv31qGntbgnRwI5ORQQ",
									"type": "string"
								}
							]
						},
						"method": "GET",
						"header": [],
						"url": {
							"raw": "localhost:3001/products/636493781f443a0b88b4e009",
							"host": [
								"localhost"
							],
							"port": "3001",
							"path": [
								"products",
								"636493781f443a0b88b4e009"
							]
						}
					},
					"response": []
				},
				{
					"name": "update product",
					"request": {
						"auth": {
							"type": "bearer",
							"bearer": [
								{
									"key": "token",
									"value": "eyJhbGciOiJIUzI1NiIsInR5cCI6IkpXVCJ9.eyJpZCI6IjYzNjQ3ZmE4MzI0N2MyYWM1NjcwZTg5NiIsImVtYWlsIjoiamFuZUBnbWFpbC5jb20iLCJpc0FkbWluIjp0cnVlLCJpYXQiOjE2Njc1NDE0MDZ9.gRub80b9BRJIAd8B2gZr8n55hMHvKYsqLkytglizJps",
									"type": "string"
								}
							]
						},
						"method": "PATCH",
						"header": [],
						"body": {
							"mode": "raw",
							"raw": "{   \r\n    \"name\": \"Acer Nitro V\",\r\n    \"price\": 40000\r\n}",
							"options": {
								"raw": {
									"language": "json"
								}
							}
						},
						"url": {
							"raw": "localhost:3001/products/636493781f443a0b88b4e009/update",
							"host": [
								"localhost"
							],
							"port": "3001",
							"path": [
								"products",
								"636493781f443a0b88b4e009",
								"update"
							]
						}
					},
					"response": []
				},
				{
					"name": "archive product",
					"request": {
						"auth": {
							"type": "bearer",
							"bearer": [
								{
									"key": "token",
									"value": "eyJhbGciOiJIUzI1NiIsInR5cCI6IkpXVCJ9.eyJpZCI6IjYzNjM4MTIxOTRjZWM1N2Y5ODkwYzExNSIsImVtYWlsIjoiamFuZUBnbWFpbC5jb20iLCJpc0FkbWluIjp0cnVlLCJpYXQiOjE2Njc0ODE2Mzh9.kmVxNEUCSlUtwQdcQLFCmOl9ONmG2HVhjrZ84p0kOAo",
									"type": "string"
								}
							]
						},
						"method": "PATCH",
						"header": [],
						"body": {
							"mode": "raw",
							"raw": ""
						},
						"url": {
							"raw": "localhost:3001/products/636389f6867961370dcc1eaa/archive",
							"host": [
								"localhost"
							],
							"port": "3001",
							"path": [
								"products",
								"636389f6867961370dcc1eaa",
								"archive"
							]
						}
					},
					"response": []
				},
				{
					"name": "delete product",
					"request": {
						"auth": {
							"type": "bearer",
							"bearer": [
								{
									"key": "token",
									"value": "eyJhbGciOiJIUzI1NiIsInR5cCI6IkpXVCJ9.eyJpZCI6IjYzNjQ3ZmE4MzI0N2MyYWM1NjcwZTg5NiIsImVtYWlsIjoiamFuZUBnbWFpbC5jb20iLCJpc0FkbWluIjp0cnVlLCJpYXQiOjE2Njc1NDM1MzN9.HjTcKTSZLXo9gQLJ14v4yC87MG8lhdWkjElQySwBW1Q",
									"type": "string"
								}
							]
						},
						"method": "DELETE",
						"header": [],
						"url": {
							"raw": "localhost:3001/products/636493781f443a0b88b4e009/delete",
							"host": [
								"localhost"
							],
							"port": "3001",
							"path": [
								"products",
								"636493781f443a0b88b4e009",
								"delete"
							]
						}
					},
					"response": []
				}
			]
		},
		{
			"name": "Order",
			"item": [
				{
					"name": "New Request",
					"request": {
						"auth": {
							"type": "bearer",
							"bearer": [
								{
									"key": "token",
									"value": "eyJhbGciOiJIUzI1NiIsInR5cCI6IkpXVCJ9.eyJpZCI6IjYzNjRiMGNhMjUyYTc5ZWYzMTQ1MTdhOSIsImVtYWlsIjoiam9obkBnbWFpbC5jb20iLCJpc0FkbWluIjpmYWxzZSwiaWF0IjoxNjY3NTQzMjU3fQ.m4YHPCl41TWIWppT1Ocwbo1T9M4kHoZlTQ2bqx40_nE",
									"type": "string"
								}
							]
						},
						"method": "POST",
						"header": [],
						"body": {
							"mode": "raw",
							"raw": "{\r\n    \"productId\" : \"636493781f443a0b88b4e009\",\r\n    \"quantity\": 5\r\n}",
							"options": {
								"raw": {
									"language": "json"
								}
							}
						},
						"url": {
							"raw": "localhost:3001/orders/create",
							"host": [
								"localhost"
							],
							"port": "3001",
							"path": [
								"orders",
								"create"
							]
						}
					},
					"response": []
				}
			]
		},
		{
			"name": "Cart",
			"item": []
		},
		{
			"name": "Credit Card",
			"item": []
		},
		{
			"name": "Membership Card",
			"item": []
		}
	]
}