{
	"info": {
		"_postman_id": "656d32c3-dad2-45e3-8165-74e1e18f3d8f",
		"name": "Capstone2-Delizo",
		"schema": "https://schema.getpostman.com/json/collection/v2.1.0/collection.json",
		"_exporter_id": "16296390"
	},
	"item": [
		{
			"name": "Users",
			"item": [
				{
					"name": "user registration",
					"request": {
						"method": "POST",
						"header": [],
						"body": {
							"mode": "raw",
							"raw": "{\r\n    \"firstName\": \"Protacio\",\r\n    \"lastName\": \"Rizal\",\r\n    \"email\": \"protacio@gmail.com\",\r\n    \"password\": \"p@ssword123\",\r\n    \"mobileNo\": \"09995705503\"\r\n}",
							"options": {
								"raw": {
									"language": "json"
								}
							}
						},
						"url": {
							"raw": "localhost:3001/users/register",
							"host": [
								"localhost"
							],
							"port": "3001",
							"path": [
								"users",
								"register"
							]
						}
					},
					"response": []
				},
				{
					"name": "New Request",
					"request": {
						"method": "POST",
						"header": [],
						"body": {
							"mode": "raw",
							"raw": "{\r\n    \"email\": \"protacio@gmail.com\",\r\n    \"password\": \"p@ssword123\"\r\n}",
							"options": {
								"raw": {
									"language": "json"
								}
							}
						},
						"url": {
							"raw": "localhost:3001/users/login",
							"host": [
								"localhost"
							],
							"port": "3001",
							"path": [
								"users",
								"login"
							]
						}
					},
					"response": []
				}
			]
		}
	]
}