{
	"_id": "cf_32",
	"name": "cat_tuna",
	"description": "canned",
	"price": 290,
	"stocks": 45,
	"isActive": true,
	"sku": "1234-569"
}
{
	"_id": "df_32",
	"name": "dog_food",
	"description": "per kilo",
	"price": 350,
	"stocks": 50,
	"isActive": true,
	"sku": "3692-466"
}
