{
    "_id": "OrderProduct1",
    "orderId": "order1",
    "productId": "Laptop-acer",
    "Quantity": 5,
    "Price": 29000,
    "subtotal": "145,000 PHP"
   
}

{
    "_id": "OrderProduct2",
    "orderId": "order2",
    "productId": "Laptop-lenovo",
    "Quantity": 12,
    "Price": 20000,
    "subtotal": "240,000 PHP"
   
}