{
    "id": "507f1f77bcf86cd799439011",
    "firstName": "John",
    "lastName": "Smith",
    "email": "johnsmith@mail.com",
    "password": "johnhandsome",
    "isAdmin": false,
    "mobileNumber": "09221231234",
}