{
	"info": {
		"_postman_id": "1a0f0d8a-6a7f-44a9-a376-9170400729d2",
		"name": "s37-s41",
		"schema": "https://schema.getpostman.com/json/collection/v2.1.0/collection.json",
		"_exporter_id": "23653831"
	},
	"item": [
		{
			"name": "users",
			"item": [
				{
					"name": "checkEmail",
					"request": {
						"method": "POST",
						"header": [],
						"body": {
							"mode": "raw",
							"raw": "{\r\n    \"email\" : \"chicoy@friendster.com\"\r\n}",
							"options": {
								"raw": {
									"language": "json"
								}
							}
						},
						"url": {
							"raw": "localhost:4000/users/checkEmail",
							"host": [
								"localhost"
							],
							"port": "4000",
							"path": [
								"users",
								"checkEmail"
							]
						}
					},
					"response": []
				},
				{
					"name": "registerUser",
					"request": {
						"method": "POST",
						"header": [],
						"body": {
							"mode": "raw",
							"raw": "{\r\n    \"firstName\" : \"John\",\r\n    \"lastName\" : \"Doe\",\r\n    \"email\" : \"johndoe@friendster.com\",\r\n    \"password\" : \"guest1234\",\r\n    \"mobileNo\" : \"0912-234-5679\"\r\n}",
							"options": {
								"raw": {
									"language": "json"
								}
							}
						},
						"url": {
							"raw": "localhost:4000/users/register",
							"host": [
								"localhost"
							],
							"port": "4000",
							"path": [
								"users",
								"register"
							]
						}
					},
					"response": []
				},
				{
					"name": "login",
					"request": {
						"auth": {
							"type": "bearer",
							"bearer": [
								{
									"key": "token",
									"value": "",
									"type": "string"
								}
							]
						},
						"method": "POST",
						"header": [],
						"body": {
							"mode": "raw",
							"raw": "{\r\n    \"email\" : \"chicoy@friendster.com\",\r\n    \"password\" : \"guest1234\" \r\n}",
							"options": {
								"raw": {
									"language": "json"
								}
							}
						},
						"url": {
							"raw": "localhost:4000/users/login",
							"host": [
								"localhost"
							],
							"port": "4000",
							"path": [
								"users",
								"login"
							]
						}
					},
					"response": []
				},
				{
					"name": "getDetails",
					"request": {
						"method": "POST",
						"header": [],
						"body": {
							"mode": "raw",
							"raw": "{\r\n    \"_id\": \"63901e828eb8f79f9cdbb96c\"\r\n}",
							"options": {
								"raw": {
									"language": "json"
								}
							}
						},
						"url": {
							"raw": "localhost:4000/users/details",
							"host": [
								"localhost"
							],
							"port": "4000",
							"path": [
								"users",
								"details"
							]
						}
					},
					"response": []
				},
				{
					"name": "enroll user",
					"request": {
						"method": "POST",
						"header": [],
						"body": {
							"mode": "raw",
							"raw": "{\r\n    \r\n}",
							"options": {
								"raw": {
									"language": "json"
								}
							}
						},
						"url": {
							"raw": "localhost:4000/users/enroll",
							"host": [
								"localhost"
							],
							"port": "4000",
							"path": [
								"users",
								"enroll"
							]
						}
					},
					"response": []
				}
			]
		},
		{
			"name": "Courses",
			"item": [
				{
					"name": "Create a course",
					"request": {
						"auth": {
							"type": "bearer",
							"bearer": [
								{
									"key": "token",
									"value": "eyJhbGciOiJIUzI1NiIsInR5cCI6IkpXVCJ9.eyJpZCI6IjYzOGYyYzFkNTcxNGRmYzI0ODk4OTM0NyIsImVtYWlsIjoiY2hpY295QGZyaWVuZHN0ZXIuY29tIiwiaXNBZG1pbiI6dHJ1ZSwiaWF0IjoxNjcwMzI3ODgyfQ.B1CNgudqu833gFE29yF9TrZD8D7Bv6CQc5TA1GIjeLQ",
									"type": "string"
								}
							]
						},
						"method": "POST",
						"header": [],
						"body": {
							"mode": "raw",
							"raw": "{\r\n    \"name\" : \"Foreign Diplomat\",\r\n    \"description\" : \"Study of Foreign Relationship\",\r\n    \"price\" : 3000\r\n}",
							"options": {
								"raw": {
									"language": "json"
								}
							}
						},
						"url": {
							"raw": "localhost:4000/courses/create",
							"host": [
								"localhost"
							],
							"port": "4000",
							"path": [
								"courses",
								"create"
							]
						}
					},
					"response": []
				},
				{
					"name": "getAllCourse",
					"protocolProfileBehavior": {
						"disableBodyPruning": true
					},
					"request": {
						"auth": {
							"type": "bearer",
							"bearer": [
								{
									"key": "token",
									"value": "eyJhbGciOiJIUzI1NiIsInR5cCI6IkpXVCJ9.eyJpZCI6IjYzOGRlZTQxM2E4MDVjNDA5MzFiNzhlYSIsImVtYWlsIjoiY2hpY295QGZyaWVuZHN0ZXIuY29tIiwiaXNBZG1pbiI6ZmFsc2UsImlhdCI6MTY3MDMyMzk5OX0.2RmQeLDsOdkZi524KsE-M7rVJYKKRMGKadRvRBbX-hw",
									"type": "string"
								}
							]
						},
						"method": "GET",
						"header": [],
						"body": {
							"mode": "raw",
							"raw": "",
							"options": {
								"raw": {
									"language": "json"
								}
							}
						},
						"url": {
							"raw": "localhost:4000/courses/all",
							"host": [
								"localhost"
							],
							"port": "4000",
							"path": [
								"courses",
								"all"
							]
						}
					},
					"response": []
				},
				{
					"name": "getAllActiveCourses",
					"protocolProfileBehavior": {
						"disableBodyPruning": true
					},
					"request": {
						"method": "GET",
						"header": [],
						"body": {
							"mode": "raw",
							"raw": "",
							"options": {
								"raw": {
									"language": "json"
								}
							}
						},
						"url": {
							"raw": "localhost:4000/courses/active",
							"host": [
								"localhost"
							],
							"port": "4000",
							"path": [
								"courses",
								"active"
							]
						}
					},
					"response": []
				},
				{
					"name": "getSpecificCourse",
					"protocolProfileBehavior": {
						"disableBodyPruning": true
					},
					"request": {
						"auth": {
							"type": "bearer"
						},
						"method": "GET",
						"header": [],
						"body": {
							"mode": "raw",
							"raw": "",
							"options": {
								"raw": {
									"language": "json"
								}
							}
						},
						"url": {
							"raw": "localhost:4000/courses/6390265790146d7d15b6b9b8",
							"host": [
								"localhost"
							],
							"port": "4000",
							"path": [
								"courses",
								"6390265790146d7d15b6b9b8"
							]
						}
					},
					"response": []
				},
				{
					"name": "updateCourse",
					"request": {
						"auth": {
							"type": "bearer",
							"bearer": [
								{
									"key": "token",
									"value": "eyJhbGciOiJIUzI1NiIsInR5cCI6IkpXVCJ9.eyJpZCI6IjYzOTAxZTgyOGViOGY3OWY5Y2RiYjk2YyIsImVtYWlsIjoiY2hpY295QGZyaWVuZHN0ZXIuY29tIiwiaXNBZG1pbiI6dHJ1ZSwiaWF0IjoxNjcwMzg5ODM3fQ.f11uFl8ub0K4gkZXr9VkXxgKRr9eHCgulH5SAqpdTNc",
									"type": "string"
								}
							]
						},
						"method": "PATCH",
						"header": [],
						"body": {
							"mode": "raw",
							"raw": "{\r\n    \"isActive\" : true\r\n}",
							"options": {
								"raw": {
									"language": "json"
								}
							}
						},
						"url": {
							"raw": "localhost:4000/courses/6390265790146d7d15b6b9b8/archive",
							"host": [
								"localhost"
							],
							"port": "4000",
							"path": [
								"courses",
								"6390265790146d7d15b6b9b8",
								"archive"
							]
						}
					},
					"response": []
				}
			]
		}
	]
}