{
    "_id": "1239080989",
    "name": "Ru Badge Enamel Pin",
    "description": "Snatch your special edition Drag Race Badge.",
    "price": 600,
    "isActive": true,
    "stocks": 20,
    "SKU": "RPDR12904",
}
{
    "_id": "12398086767",
    "name": "How's Your Head, Hun? Snapback Hat",
    "description": "We’ve got one important question to ask…How’s Your Head, Hun?",
    "price": 1200,
    "isActive": true,
    "stocks": 20,
    "SKU": "RPDR12901",
}
{
    "_id": "12389767675",
    "name": "You're a Winner, Baby! Badge Display Banner",
    "description": "Display all your badges with this sick'ning display banner.",
    "price": 900,
    "isActive": true,
    "stocks": 20,
    "SKU": "RPDR12909",
}