{
    "userId": "7TG9q1ZG1ilgTfw7",
    "transactionDate": "2022-03-12T16:00:00.00Z",
    "status": "arrived",
    "total": 599
}
{
    "userId": "7TG9q1ZG1ilgTfw7",
    "transactionDate": "2022-02-15T15:00:00.00Z",
    "status": "arrived",
    "total": 1147
}