{
_id : 63909997cf70d385532f0336
    "fullName": "Thea Juntado",
    "email": "thea@mail.com",
    "password": "admin1234"
}

{

_id : 63909a21cf70d385532f0339
    "fullName": "Azu Azuzu",
    "email": "azu@mail.com",
    "password": "azu1234"
}

{

_id : 639741929c7b84f7ecc18efe
    "fullName": "Jerma Harrington",
    "email": "jerma985@mail.com",
    "password": "sus123"
}
{
_id : 6397466245846256513e92c5
    "fullName": "Mike Wazowski",
    "email": "monstersinc@mail.com",
    "password": "scary123"
}