{
	"orderId": "Order151",
	"userId": "u15",
	"transactionDate": "2022-11-11",
	"status": "Paid",
	"total": 2600 
}
{
	"orderId": "Order140",
	"userId": "u15",
	"transactionDate": "2022-08-15",
	"status": "Paid",
	"total":  750
}
{
	"orderId": "Order160",
	"userId": "u25",
	"transactionDate": "2022-10-30",
	"status": "Paid",
	"total": 950
}