{   
    "_id": "ZgdUJeFneAqNlwei6rYS",
    "orderId": "RG5Y7fsOSiD3KfoGJyO1",
    "productId" : "OMyOGbCtJNeTnuIXMfoF",
    "quantity" : 5,
    "price" : 181,
    "subtotal" : 905
}
{
    "_id": "TBGnfXePxSt3bLUcX7CV",
    "orderId": "fiRaZGIEU1M60SNLPpfS",
    "productId" : "TBGnfXePxSt3bLUcX7CV",
    "quantity" : 2,
    "price" : 90,
    "subtotal" : 180
}