{
	"info": {
		"_postman_id": "cdc61828-47ab-40ff-a66b-872827ed1095",
		"name": "Capstone2",
		"schema": "https://schema.getpostman.com/json/collection/v2.1.0/collection.json",
		"_exporter_id": "24501675"
	},
	"item": [
		{
			"name": "Users",
			"item": [
				{
					"name": "Register user",
					"request": {
						"method": "POST",
						"header": [],
						"body": {
							"mode": "raw",
							"raw": "{\r\n    \"email\": \"johndoe@gmail.com\",\r\n    \"password\": \"1234\",\r\n    \"mobileNo\": \"0945-789-1234\"\r\n}",
							"options": {
								"raw": {
									"language": "json"
								}
							}
						},
						"url": {
							"raw": "localhost:4000/users/register",
							"host": [
								"localhost"
							],
							"port": "4000",
							"path": [
								"users",
								"register"
							]
						}
					},
					"response": []
				},
				{
					"name": "User login",
					"request": {
						"method": "POST",
						"header": [],
						"body": {
							"mode": "raw",
							"raw": "{\r\n    \"email\": \"sampleemail23@gmail.com\",\r\n    \"password\": \"1234\"\r\n}",
							"options": {
								"raw": {
									"language": "json"
								}
							}
						},
						"url": {
							"raw": "localhost:4000/users/login",
							"host": [
								"localhost"
							],
							"port": "4000",
							"path": [
								"users",
								"login"
							]
						}
					},
					"response": []
				},
				{
					"name": "Retrieve user details using req.body.id",
					"request": {
						"method": "POST",
						"header": [],
						"body": {
							"mode": "raw",
							"raw": "{\r\n    \"id\" : \"63906b36b6d2ae1b4eec30f7\"\r\n}",
							"options": {
								"raw": {
									"language": "json"
								}
							}
						},
						"url": {
							"raw": "localhost:4000/users/details",
							"host": [
								"localhost"
							],
							"port": "4000",
							"path": [
								"users",
								"details"
							]
						}
					},
					"response": []
				},
				{
					"name": "Upgrade user",
					"request": {
						"auth": {
							"type": "bearer",
							"bearer": [
								{
									"key": "token",
									"value": "{{adminuser}}",
									"type": "string"
								}
							]
						},
						"method": "PATCH",
						"header": [],
						"body": {
							"mode": "raw",
							"raw": "{\r\n    \r\n}",
							"options": {
								"raw": {
									"language": "json"
								}
							}
						},
						"url": {
							"raw": "localhost:4000/users/638f4490bd34c7d85c3e1166/setAsAdmin",
							"host": [
								"localhost"
							],
							"port": "4000",
							"path": [
								"users",
								"638f4490bd34c7d85c3e1166",
								"setAsAdmin"
							]
						}
					},
					"response": []
				},
				{
					"name": "Retrieve user details",
					"request": {
						"auth": {
							"type": "bearer",
							"bearer": [
								{
									"key": "token",
									"value": "{{adminuser}}",
									"type": "string"
								}
							]
						},
						"method": "GET",
						"header": [],
						"url": {
							"raw": "https://capstone-2-guzon.onrender.com/users/63906005e4a99257dc1fc279/userDetails",
							"protocol": "https",
							"host": [
								"capstone-2-guzon",
								"onrender",
								"com"
							],
							"path": [
								"users",
								"63906005e4a99257dc1fc279",
								"userDetails"
							]
						}
					},
					"response": []
				}
			]
		},
		{
			"name": "Products",
			"item": [
				{
					"name": "Create product",
					"request": {
						"auth": {
							"type": "bearer",
							"bearer": [
								{
									"key": "token",
									"value": "{{normauser}}",
									"type": "string"
								}
							]
						},
						"method": "POST",
						"header": [],
						"body": {
							"mode": "raw",
							"raw": "{\r\n    \"name\": \"Samsung UHD TV\",\r\n    \"description\": \"Real 4K resolution, HDR, UHD Dimming, Adaptive Sound, Wireless LAN Built-In (WiFi)\",\r\n    \"price\" : \"24000\"\r\n}",
							"options": {
								"raw": {
									"language": "json"
								}
							}
						},
						"url": {
							"raw": "localhost:4000/products/create",
							"host": [
								"localhost"
							],
							"port": "4000",
							"path": [
								"products",
								"create"
							]
						}
					},
					"response": []
				},
				{
					"name": "Retrieve active products",
					"protocolProfileBehavior": {
						"disableBodyPruning": true
					},
					"request": {
						"method": "GET",
						"header": [],
						"body": {
							"mode": "raw",
							"raw": "",
							"options": {
								"raw": {
									"language": "json"
								}
							}
						},
						"url": {
							"raw": "localhost:4000/products/active",
							"host": [
								"localhost"
							],
							"port": "4000",
							"path": [
								"products",
								"active"
							]
						}
					},
					"response": []
				},
				{
					"name": "Retrieve single product",
					"request": {
						"method": "GET",
						"header": [],
						"url": {
							"raw": "localhost:4000/products/63906dd05348fbb405f6390e",
							"host": [
								"localhost"
							],
							"port": "4000",
							"path": [
								"products",
								"63906dd05348fbb405f6390e"
							]
						}
					},
					"response": []
				},
				{
					"name": "Update product",
					"request": {
						"auth": {
							"type": "bearer",
							"bearer": [
								{
									"key": "token",
									"value": "{{adminuser}}",
									"type": "string"
								}
							]
						},
						"method": "PATCH",
						"header": [],
						"body": {
							"mode": "raw",
							"raw": "{\r\n    \"name\" : \"Anker Power Bank\",\r\n    \"price\": \"300\"\r\n}",
							"options": {
								"raw": {
									"language": "json"
								}
							}
						},
						"url": {
							"raw": "localhost:4000/products/63906dd05348fbb405f6390e",
							"host": [
								"localhost"
							],
							"port": "4000",
							"path": [
								"products",
								"63906dd05348fbb405f6390e"
							]
						}
					},
					"response": []
				},
				{
					"name": "Archive product",
					"request": {
						"auth": {
							"type": "bearer",
							"bearer": [
								{
									"key": "token",
									"value": "{{sampleemail23}}",
									"type": "string"
								}
							]
						},
						"method": "PATCH",
						"header": [],
						"url": {
							"raw": "https://capstone-2-guzon.onrender.com/products/63906dd05348fbb405f6390e/archive",
							"protocol": "https",
							"host": [
								"capstone-2-guzon",
								"onrender",
								"com"
							],
							"path": [
								"products",
								"63906dd05348fbb405f6390e",
								"archive"
							]
						}
					},
					"response": []
				}
			]
		},
		{
			"name": "Orders",
			"item": [
				{
					"name": "create order",
					"request": {
						"auth": {
							"type": "bearer",
							"bearer": [
								{
									"key": "token",
									"value": "{{sampleemail23}}",
									"type": "string"
								}
							]
						},
						"method": "POST",
						"header": [],
						"body": {
							"mode": "raw",
							"raw": "{\r\n    \"productId\": \"63906dd05348fbb405f6390e\",\r\n    \"quantity\": 2,\r\n    \"totalAmount\" : 600\r\n}",
							"options": {
								"raw": {
									"language": "json"
								}
							}
						},
						"url": {
							"raw": "localhost:4000/orders/checkout",
							"host": [
								"localhost"
							],
							"port": "4000",
							"path": [
								"orders",
								"checkout"
							]
						}
					},
					"response": []
				},
				{
					"name": "Show orders (admin)",
					"request": {
						"auth": {
							"type": "bearer",
							"bearer": [
								{
									"key": "token",
									"value": "{{adminuser}}",
									"type": "string"
								}
							]
						},
						"method": "GET",
						"header": [],
						"url": {
							"raw": "localhost:4000/orders",
							"host": [
								"localhost"
							],
							"port": "4000",
							"path": [
								"orders"
							]
						}
					},
					"response": []
				},
				{
					"name": "Retrieve authenticated user's orders",
					"request": {
						"auth": {
							"type": "bearer",
							"bearer": [
								{
									"key": "token",
									"value": "{{normauser}}",
									"type": "string"
								}
							]
						},
						"method": "GET",
						"header": [],
						"url": {
							"raw": "localhost:4000/orders/myOrders",
							"host": [
								"localhost"
							],
							"port": "4000",
							"path": [
								"orders",
								"myOrders"
							]
						}
					},
					"response": []
				}
			]
		}
	],
	"variable": [
		{
			"key": "adminuser",
			"value": "eyJhbGciOiJIUzI1NiIsInR5cCI6IkpXVCJ9.eyJpZCI6IjYzOTA2YjM2YjZkMmFlMWI0ZWVjMzBmNyIsImVtYWlsIjoiYWRtaW5AZ21haWwuY29tIiwiaXNBZG1pbiI6dHJ1ZSwiaWF0IjoxNjcwNDA5MDc2fQ._bewzc0ztqp9AU-1WTj94Wco2vSchALtyLYMHz9FeM4"
		},
		{
			"key": "normauser",
			"value": "WxAZ21haWwuY29tIiwiaXNBZG1pbiI6ZmFsc2"
		},
		{
			"key": "sampleemail23",
			"value": "eyJhbGciOiJIUzI1NiIsInR5cCI6IkpXVCJ9.eyJpZCI6IjYzOTA2MDA1ZTRhOTkyNTdkYzFmYzI3OSIsImVtYWlsIjoic2FtcGxlZW1haWwyM0BnbWFpbC5jb20iLCJpc0FkbWluIjpmYWxzZSwiaWF0IjoxNjcwODQxNTk1fQ.eB395iLQjT4aiFtTjphgmdBOEEfaJQEGnXzaa876qEk"
		},
		{
			"key": "sampleemail",
			"value": "eyJhbGciOiJIUzI1NiIsInR5cCI6IkpXVCJ9.eyJpZCI6IjYzOTA2MDA1ZTRhOTkyNTdkYzFmYzI3OSIsImVtYWlsIjoic2FtcGxlZW1haWwyM0BnbWFpbC5jb20iLCJpc0FkbWluIjpmYWxzZSwiaWF0IjoxNjcwODQxNTk1fQ.eB395iLQjT4aiFtTjphgmdBOEEfaJQEGnXzaa876qEk"
		}
	]
}