[
    {
        "_id": "XF32178900000",
        "orderID": "order_user_123_1",
        "productID": "product_VRYGD908",
        "quantity": 1,
        "price": 10000,
        "subTotal": 10000
    },
    {
        "_id": "XR52234900000",
        "orderID": "order_user_456_1",
        "productID": "product_VRYGD507",
        "quantity": 2,
        "price": 450,
        "subTotal": 900
    },
    {
        "_id": "XZ95277600000",
        "orderID": "order_user_999_1",
        "productID": "product_VRYGD997",
        "quantity": 1,
        "price": 1600,
        "subTotal": 1600
    }
]