[
    {
        "_id": "507f1f77bcf86cd799439000",
        "firstName": "Mommy",
        "lastName": "Mother",
        "email": "mommy@mother.com",
        "mobileNumber": "09000000000",
        "password": "mommythemother",
        "isAdmin": true
    },
    {
        "_id": "507f1f77bcf86cd799439010",
        "firstName": "Avery",
        "lastName": "Arreola",
        "email": "avery@baby.com",
        "mobileNumber": "09123456789",
        "password": "averythecutie",
        "isAdmin": false
    },
    {
        "_id": "507f1f77bcf86cd799439020",
        "firstName": "Axis",
        "lastName": "Arreola",
        "email": "axis@kid.com",
        "mobileNumber": "09987654321",
        "password": "axisthepogi",
        "isAdmin": false
    }
]