{
    "User ID": "507f1f77bcf86cd799439011",
    "Transaction Date": "October 10, 2022",
    "Status": "Approved",
    "Total": "1",
    "_id" : "18sdfg876876dfgs"
}

{
    "User ID": "07f1f77bcf86cd799439012",
    "Transaction Date": "November 11, 2022",
    "Status": "For Approval",
    "Total": "2",
    "_id" : "239asdflagsdflkjh"
}

