{
	"Name":"iPhone 13 Pro Max",
	"Description": "Cellphone",
	"Price" : "P 66,000",
	"Stocks" : 78,
	"Is Active?": true,
	"SKU" : "ZF012AWE",
	"_id" : "asd8f76876adsfkjlhlakjh"
}

{
	"Name":"LeBron 20",
	"Description": "Shoes",
	"Price" : "P 11,000",
	"Stocks" : 105,
	"Is Active?": true,
	"SKU" : "GH945HUG",
	"_id" : "q234ljhlkasjdhflaksh8"
}

{
	"Name":"MacBook Air",
	"Description": "Laptop",
	"Price" : "P 70,000",
	"Stocks" : 23,
	"Is Active?": true,
	"SKU" : "JS375JIP",
	"_id" : "adsg8769876as9d8f76"
}