{
	"info": {
		"_postman_id": "0c1f4abf-1bdd-46c8-94de-73a958d8df10",
		"name": "s35 Discussion",
		"schema": "https://schema.getpostman.com/json/collection/v2.1.0/collection.json",
		"_exporter_id": "24050872"
	},
	"item": [
		{
			"name": "ADD TASK - POST Method",
			"request": {
				"method": "POST",
				"header": [],
				"body": {
					"mode": "raw",
					"raw": "{\r\n    \"name\": \"Eat\"\r\n}",
					"options": {
						"raw": {
							"language": "json"
						}
					}
				},
				"url": {
					"raw": "http://localhost:3001/tasks",
					"protocol": "http",
					"host": [
						"localhost"
					],
					"port": "3001",
					"path": [
						"tasks"
					]
				}
			},
			"response": []
		},
		{
			"name": "GET TASK - GET Method",
			"request": {
				"method": "GET",
				"header": []
			},
			"response": []
		},
		{
			"name": "ADD USER  - POST Method",
			"request": {
				"method": "POST",
				"header": [],
				"body": {
					"mode": "raw",
					"raw": "{\r\n    \"username\": \"bogart\",\r\n    \"password\": \"theexplorer\"\r\n}",
					"options": {
						"raw": {
							"language": "json"
						}
					}
				},
				"url": {
					"raw": "http://localhost:3001/signup",
					"protocol": "http",
					"host": [
						"localhost"
					],
					"port": "3001",
					"path": [
						"signup"
					]
				}
			},
			"response": []
		},
		{
			"name": "GET USER - GET Method",
			"request": {
				"method": "GET",
				"header": []
			},
			"response": []
		}
	]
}