[
  {
    "_id": "_kmrd1zcb5",
    "firstName": "Al",
    "lastName": "Olaguer",
    "username": "alpog",
    "email": "vic_alpog@ymail.com",
    "mobileNo": "4310153",
    "password": "$2a$10$3EC1YXHuyDMLkYrMea3WWOdFrSjYIw1kIWxhjLyW8r7ziXBjRw5km"
  },
  {
    "_id": "_dopzoe2oq",
    "firstName": "Al Victor",
    "lastName": "Olaguer",
    "username": "alOlaguer",
    "email": "vic.alpog23@gmail.com",
    "mobileNo": "09293991126",
    "password": "$2a$10$o7Fp.8IHNOX/tnXJBu32DOpXXRje8mnIm2MFUhH.bFGDIeWtitPV6"
  }
]