{
	"info": {
		"_postman_id": "0991f237-272d-417f-a614-e4358aa5c6e0",
		"name": "E-Commerce",
		"schema": "https://schema.getpostman.com/json/collection/v2.1.0/collection.json",
		"_exporter_id": "24050872"
	},
	"item": [
		{
			"name": "Users",
			"item": [
				{
					"name": "User Registration",
					"request": {
						"method": "POST",
						"header": [],
						"body": {
							"mode": "raw",
							"raw": "{\r\n    \"firstName\": \"admin2\",\r\n    \"lastName\": \"aduser2\",\r\n    \"age\": 24,\r\n    \"username\": \"admin4\",\r\n    \"email\": \"admin2@mail.com\",\r\n    \"password\": \"admin123\",\r\n    \"mobileNo\": \"09123456788\"\r\n}",
							"options": {
								"raw": {
									"language": "json"
								}
							}
						},
						"url": {
							"raw": "http://localhost:2300/users/register",
							"protocol": "http",
							"host": [
								"localhost"
							],
							"port": "2300",
							"path": [
								"users",
								"register"
							]
						}
					},
					"response": []
				},
				{
					"name": "User Login",
					"request": {
						"auth": {
							"type": "bearer",
							"bearer": [
								{
									"key": "token",
									"value": "eyJhbGciOiJIUzI1NiIsInR5cCI6IkpXVCJ9.eyJpZCI6IjYzNjQ4MGM5NWM2YmFhMWVjZDM2ODgxYiIsImVtYWlsIjoiYWRtaW4xQG1haWwuY29tIiwidXNlcm5hbWUiOiJhZG1pbjEiLCJpc1N1cGVyQWRtaW4iOmZhbHNlLCJpc0FkbWluIjp0cnVlLCJpYXQiOjE2Njc1MzYzNzN9.K4HFDSJ24XZzXCTu6Xz_TREndmTWczbCrH68venb3sY",
									"type": "string"
								}
							]
						},
						"method": "POST",
						"header": [],
						"body": {
							"mode": "raw",
							"raw": "{\r\n    \"email\": \"user1@mail\",\r\n    \"password\": \"123user1\"\r\n}",
							"options": {
								"raw": {
									"language": "json"
								}
							}
						},
						"url": {
							"raw": "http://localhost:2300/users/login",
							"protocol": "http",
							"host": [
								"localhost"
							],
							"port": "2300",
							"path": [
								"users",
								"login"
							]
						}
					},
					"response": []
				},
				{
					"name": "Get Profile",
					"request": {
						"method": "GET",
						"header": []
					},
					"response": []
				},
				{
					"name": "Set As Admin",
					"request": {
						"auth": {
							"type": "bearer",
							"bearer": [
								{
									"key": "token",
									"value": "eyJhbGciOiJIUzI1NiIsInR5cCI6IkpXVCJ9.eyJpZCI6IjYzNjNlZmU2YzU3MmE2MjNhMTc1Y2VjMSIsImVtYWlsIjoidmljX2FscG9nQHltYWlsLmNvbSIsInVzZXJuYW1lIjoiYWxvbGFndWVyMjMiLCJpc1N1cGVyQWRtaW4iOnRydWUsImlzQWRtaW4iOnRydWUsImlhdCI6MTY2NzU3Mzk4M30.V9MihO5vrrmmxwbKl57GzcpXaprhtFUBQhFHHn3tLQM",
									"type": "string"
								}
							]
						},
						"method": "PATCH",
						"header": [],
						"body": {
							"mode": "raw",
							"raw": "{\r\n    \r\n}",
							"options": {
								"raw": {
									"language": "json"
								}
							}
						},
						"url": {
							"raw": "http://localhost:2300/users/6363f0d7c572a623a175cec3/setAsAdmin",
							"protocol": "http",
							"host": [
								"localhost"
							],
							"port": "2300",
							"path": [
								"users",
								"6363f0d7c572a623a175cec3",
								"setAsAdmin"
							]
						}
					},
					"response": []
				},
				{
					"name": "Check if Email Exists",
					"request": {
						"method": "POST",
						"header": [],
						"body": {
							"mode": "raw",
							"raw": "{\r\n    \"email\": \"vic_alpog@ymail.com\"\r\n}",
							"options": {
								"raw": {
									"language": "json"
								}
							}
						},
						"url": {
							"raw": "http://localhost:2300/users/checkEmail",
							"protocol": "http",
							"host": [
								"localhost"
							],
							"port": "2300",
							"path": [
								"users",
								"checkEmail"
							]
						}
					},
					"response": []
				},
				{
					"name": "Get All Users",
					"request": {
						"auth": {
							"type": "bearer",
							"bearer": [
								{
									"key": "token",
									"value": "eyJhbGciOiJIUzI1NiIsInR5cCI6IkpXVCJ9.eyJpZCI6IjYzNjNlZmU2YzU3MmE2MjNhMTc1Y2VjMSIsImVtYWlsIjoidmljX2FscG9nQHltYWlsLmNvbSIsInVzZXJuYW1lIjoiYWxvbGFndWVyMjMiLCJpc1N1cGVyQWRtaW4iOnRydWUsImlzQWRtaW4iOmZhbHNlLCJpYXQiOjE2Njc1NzcwODh9.Z7mVnxLG7_LigMijAfwygDQJhdHJKMWBZ-wzhPbnMCc",
									"type": "string"
								}
							]
						},
						"method": "GET",
						"header": [],
						"url": {
							"raw": "http://localhost:2300/users/all",
							"protocol": "http",
							"host": [
								"localhost"
							],
							"port": "2300",
							"path": [
								"users",
								"all"
							]
						}
					},
					"response": []
				}
			]
		},
		{
			"name": "Products",
			"item": [
				{
					"name": "Get Active Product",
					"request": {
						"method": "GET",
						"header": []
					},
					"response": []
				},
				{
					"name": "Get Single Product",
					"request": {
						"method": "GET",
						"header": [],
						"url": {
							"raw": "http://localhost:2300/products/\":productId\"",
							"protocol": "http",
							"host": [
								"localhost"
							],
							"port": "2300",
							"path": [
								"products",
								"\":productId\""
							]
						}
					},
					"response": []
				},
				{
					"name": "List Product",
					"request": {
						"auth": {
							"type": "bearer",
							"bearer": [
								{
									"key": "token",
									"value": "eyJhbGciOiJIUzI1NiIsInR5cCI6IkpXVCJ9.eyJpZCI6IjYzNjNlZmU2YzU3MmE2MjNhMTc1Y2VjMSIsImVtYWlsIjoidmljX2FscG9nQHltYWlsLmNvbSIsInVzZXJuYW1lIjoiYWxvbGFndWVyMjMiLCJpc1N1cGVyQWRtaW4iOnRydWUsImlzQWRtaW4iOmZhbHNlLCJpYXQiOjE2Njc1NzU0ODl9.umzkkTp6y6I-qsBml4HHiY75jSACU8f4nmQSroFYKng",
									"type": "string"
								}
							]
						},
						"method": "POST",
						"header": [],
						"body": {
							"mode": "raw",
							"raw": "{\r\n    \"name\": \"Product 4 \",\r\n    \"description\": \"descrpt 4\",\r\n    \"price\": 40\r\n}",
							"options": {
								"raw": {
									"language": "json"
								}
							}
						},
						"url": {
							"raw": "http://localhost:2300/products/listProduct",
							"protocol": "http",
							"host": [
								"localhost"
							],
							"port": "2300",
							"path": [
								"products",
								"listProduct"
							]
						}
					},
					"response": []
				},
				{
					"name": "Get All Products (Admin || SAdmin)",
					"request": {
						"method": "GET",
						"header": [],
						"url": {
							"raw": "http://localhost:2300/products/all",
							"protocol": "http",
							"host": [
								"localhost"
							],
							"port": "2300",
							"path": [
								"products",
								"all"
							]
						}
					},
					"response": []
				},
				{
					"name": "Update Product",
					"request": {
						"method": "PATCH",
						"header": [],
						"url": {
							"raw": "http://localhost:2300/products/\":productId\"/update",
							"protocol": "http",
							"host": [
								"localhost"
							],
							"port": "2300",
							"path": [
								"products",
								"\":productId\"",
								"update"
							]
						}
					},
					"response": []
				},
				{
					"name": "Archive Product",
					"request": {
						"method": "PATCH",
						"header": [],
						"url": {
							"raw": "http://localhost:2300/products/\":productId\"/archive",
							"protocol": "http",
							"host": [
								"localhost"
							],
							"port": "2300",
							"path": [
								"products",
								"\":productId\"",
								"archive"
							]
						}
					},
					"response": []
				},
				{
					"name": "Unarchive Product",
					"request": {
						"method": "PATCH",
						"header": [],
						"url": {
							"raw": "http://localhost:2300/products/\":productId\"/unarchive",
							"protocol": "http",
							"host": [
								"localhost"
							],
							"port": "2300",
							"path": [
								"products",
								"\":productId\"",
								"unarchive"
							]
						}
					},
					"response": []
				}
			]
		},
		{
			"name": "Orders",
			"item": []
		}
	]
}