{
	"info": {
		"_postman_id": "1301bbb7-11cd-42fc-b913-e5c49b03da2a",
		"name": "COURSE BOOKING API",
		"schema": "https://schema.getpostman.com/json/collection/v2.1.0/collection.json",
		"_exporter_id": "23654636"
	},
	"item": [
		{
			"name": "users",
			"item": [
				{
					"name": "CHECK EMAIL - POST METHOD",
					"request": {
						"method": "POST",
						"header": [],
						"body": {
							"mode": "raw",
							"raw": "{\r\n    \"email\" : \"russel@gmail.com\"\r\n}",
							"options": {
								"raw": {
									"language": "json"
								}
							}
						},
						"url": {
							"raw": "http://localhost:4000/users/checkEmail",
							"protocol": "http",
							"host": [
								"localhost"
							],
							"port": "4000",
							"path": [
								"users",
								"checkEmail"
							]
						}
					},
					"response": []
				},
				{
					"name": "USER REGISTRATION - POST METHOD",
					"request": {
						"method": "POST",
						"header": [],
						"body": {
							"mode": "raw",
							"raw": "{\r\n  \"firstName\" : \"Russel\",\r\n  \"lastName\" : \"Dotdot\",\r\n  \"email\" : \"russel@mail.com\",\r\n  \"mobileNo\" : \"1234567890\",\r\n  \"password\" : \"russel123\"\r\n}",
							"options": {
								"raw": {
									"language": "json"
								}
							}
						},
						"url": {
							"raw": "http://localhost:4000/users/register",
							"protocol": "http",
							"host": [
								"localhost"
							],
							"port": "4000",
							"path": [
								"users",
								"register"
							]
						}
					},
					"response": []
				},
				{
					"name": "USER LOGIN - POST METHOD",
					"request": {
						"method": "POST",
						"header": [],
						"body": {
							"mode": "raw",
							"raw": "{\r\n    \"email\" : \"john@mail.com\",\r\n    \"password\" : \"john1234\"\r\n}",
							"options": {
								"raw": {
									"language": "json"
								}
							}
						},
						"url": {
							"raw": "http://localhost:4000/users/login",
							"protocol": "http",
							"host": [
								"localhost"
							],
							"port": "4000",
							"path": [
								"users",
								"login"
							]
						}
					},
					"response": []
				},
				{
					"name": "GET USER DETAIL - POST METHOD",
					"request": {
						"method": "POST",
						"header": [],
						"body": {
							"mode": "raw",
							"raw": "{\r\n    \"id\" : \"636202a7059e66ad9da92744\"\r\n}",
							"options": {
								"raw": {
									"language": "json"
								}
							}
						},
						"url": {
							"raw": "http://localhost:4000/users/details",
							"protocol": "http",
							"host": [
								"localhost"
							],
							"port": "4000",
							"path": [
								"users",
								"details"
							]
						}
					},
					"response": []
				},
				{
					"name": "get user details from token",
					"request": {
						"auth": {
							"type": "bearer",
							"bearer": [
								{
									"key": "token",
									"value": "eyJhbGciOiJIUzI1NiIsInR5cCI6IkpXVCJ9.eyJpZCI6IjYzNWI4NWE4ZjE5ZGMwODUxNjNkODBlMSIsImVtYWlsIjoiam9obkBtYWlsLmNvbSIsImlzQWRtaW4iOmZhbHNlLCJpYXQiOjE2NjczNzEzMTF9.isHIoF-g8799u6WqXZ1LyAVcm4AjcrXYTH9OfDyROUs",
									"type": "string"
								}
							]
						},
						"method": "POST",
						"header": [],
						"body": {
							"mode": "raw",
							"raw": "",
							"options": {
								"raw": {
									"language": "json"
								}
							}
						},
						"url": {
							"raw": "http://localhost:4000/users/details",
							"protocol": "http",
							"host": [
								"localhost"
							],
							"port": "4000",
							"path": [
								"users",
								"details"
							]
						}
					},
					"response": []
				}
			]
		},
		{
			"name": "courses",
			"item": [
				{
					"name": "add new course",
					"request": {
						"auth": {
							"type": "bearer",
							"bearer": [
								{
									"key": "token",
									"value": "eyJhbGciOiJIUzI1NiIsInR5cCI6IkpXVCJ9.eyJpZCI6IjYzNWI4NWE4ZjE5ZGMwODUxNjNkODBlMSIsImVtYWlsIjoiam9obkBtYWlsLmNvbSIsImlzQWRtaW4iOnRydWUsImlhdCI6MTY2NzM3MjU1MX0.45qOwhSvdCH7H8Kj0LfODkdljw4rCeHYIxAjLd8XvbA",
									"type": "string"
								}
							]
						},
						"method": "POST",
						"header": [],
						"body": {
							"mode": "raw",
							"raw": "{\r\n    \"name\": \"Gaming\",\r\n    \"description\": \"Study of games\",\r\n    \"price\": 100\r\n}",
							"options": {
								"raw": {
									"language": "json"
								}
							}
						},
						"url": {
							"raw": "http://localhost:4000/courses/create",
							"protocol": "http",
							"host": [
								"localhost"
							],
							"port": "4000",
							"path": [
								"courses",
								"create"
							]
						}
					},
					"response": []
				},
				{
					"name": "get all courses",
					"request": {
						"method": "GET",
						"header": [],
						"url": {
							"raw": "http://localhost:4000/courses/all",
							"protocol": "http",
							"host": [
								"localhost"
							],
							"port": "4000",
							"path": [
								"courses",
								"all"
							]
						}
					},
					"response": []
				},
				{
					"name": "get active courses",
					"request": {
						"method": "GET",
						"header": [],
						"url": {
							"raw": "http://localhost:4000/courses/active",
							"protocol": "http",
							"host": [
								"localhost"
							],
							"port": "4000",
							"path": [
								"courses",
								"active"
							]
						}
					},
					"response": []
				},
				{
					"name": "get single course",
					"request": {
						"method": "GET",
						"header": [],
						"url": {
							"raw": "http://localhost:4000/courses/6361e9845990bdd17e725d2b",
							"protocol": "http",
							"host": [
								"localhost"
							],
							"port": "4000",
							"path": [
								"courses",
								"6361e9845990bdd17e725d2b"
							]
						}
					},
					"response": []
				},
				{
					"name": "update single course",
					"request": {
						"auth": {
							"type": "bearer",
							"bearer": [
								{
									"key": "token",
									"value": "eyJhbGciOiJIUzI1NiIsInR5cCI6IkpXVCJ9.eyJpZCI6IjYzNWI4NWE4ZjE5ZGMwODUxNjNkODBlMSIsImVtYWlsIjoiam9obkBtYWlsLmNvbSIsImlzQWRtaW4iOnRydWUsImlhdCI6MTY2NzM3ODU2NH0.jemFhRFXtBa_vgbJNBKeCf-R4fMu8M-mZFfNO15rDpY",
									"type": "string"
								}
							]
						},
						"method": "PATCH",
						"header": [],
						"body": {
							"mode": "raw",
							"raw": "{\r\n    \"name\" : \"Updated Name\",\r\n    \"description\" : \"Updated Description\",\r\n    \"price\" : 9000\r\n}",
							"options": {
								"raw": {
									"language": "json"
								}
							}
						},
						"url": {
							"raw": "http://localhost:4000/courses/6361e9845990bdd17e725d2b/update",
							"protocol": "http",
							"host": [
								"localhost"
							],
							"port": "4000",
							"path": [
								"courses",
								"6361e9845990bdd17e725d2b",
								"update"
							]
						}
					},
					"response": []
				},
				{
					"name": "archive single course",
					"request": {
						"auth": {
							"type": "bearer",
							"bearer": [
								{
									"key": "token",
									"value": "eyJhbGciOiJIUzI1NiIsInR5cCI6IkpXVCJ9.eyJpZCI6IjYzNWI4NWE4ZjE5ZGMwODUxNjNkODBlMSIsImVtYWlsIjoiam9obkBtYWlsLmNvbSIsImlzQWRtaW4iOnRydWUsImlhdCI6MTY2NzM3OTk3OX0.s5-SVoNvlvxMOMSc-SkWWHI6y1PAhNqCQqxEQiE9e8o",
									"type": "string"
								}
							]
						},
						"method": "PATCH",
						"header": [],
						"url": {
							"raw": "http://localhost:4000/courses/6361e9845990bdd17e725d2b/archive",
							"protocol": "http",
							"host": [
								"localhost"
							],
							"port": "4000",
							"path": [
								"courses",
								"6361e9845990bdd17e725d2b",
								"archive"
							]
						}
					},
					"response": []
				}
			]
		}
	]
}