{
	"info": {
		"_postman_id": "187913dc-36b2-4775-9f42-98be07753508",
		"name": "E-Commerce API",
		"schema": "https://schema.getpostman.com/json/collection/v2.1.0/collection.json",
		"_exporter_id": "24050596"
	},
	"item": [
		{
			"name": "Users",
			"item": [
				{
					"name": "USER REGISTRATION",
					"request": {
						"method": "POST",
						"header": [],
						"body": {
							"mode": "raw",
							"raw": "{\n    \"email\" : \"discordia@mail.com\",\n    \"password\" : \"discordia123\"\n}",
							"options": {
								"raw": {
									"language": "json"
								}
							}
						},
						"url": {
							"raw": "http://localhost:4000/users/register",
							"protocol": "http",
							"host": [
								"localhost"
							],
							"port": "4000",
							"path": [
								"users",
								"register"
							]
						}
					},
					"response": []
				},
				{
					"name": "USER LOGIN",
					"request": {
						"method": "POST",
						"header": [],
						"body": {
							"mode": "raw",
							"raw": "{\n    \"email\" : \"yorick@mail.com\",\n    \"password\" : \"yorick123\"\n}",
							"options": {
								"raw": {
									"language": "json"
								}
							}
						},
						"url": {
							"raw": "localhost:4000/users/login",
							"host": [
								"localhost"
							],
							"port": "4000",
							"path": [
								"users",
								"login"
							]
						}
					},
					"response": []
				}
			]
		},
		{
			"name": "Products",
			"item": [
				{
					"name": "CREATE PRODUCT",
					"request": {
						"auth": {
							"type": "bearer",
							"bearer": [
								{
									"key": "token",
									"value": "eyJhbGciOiJIUzI1NiIsInR5cCI6IkpXVCJ9.eyJpZCI6IjYzNjM4NDMzNzA1ZmJkNzk3N2YyOGEyMCIsImVtYWlsIjoieW9yaWNrQG1haWwuY29tIiwiaXNBZG1pbiI6dHJ1ZSwiaWF0IjoxNjY3NTI2MzA3fQ.CYgxxp68306TBO63NqPKgXZiTDH6d91gESXBykzl7Ek",
									"type": "string"
								}
							]
						},
						"method": "POST",
						"header": [],
						"body": {
							"mode": "raw",
							"raw": "{\n    \"name\" : \"Recoil Magazine 23rd Edition\",\n    \"description\" : \"A magazine about guns\",\n    \"price\" : 500\n}",
							"options": {
								"raw": {
									"language": "json"
								}
							}
						},
						"url": {
							"raw": "http://localhost:4000/products/create",
							"protocol": "http",
							"host": [
								"localhost"
							],
							"port": "4000",
							"path": [
								"products",
								"create"
							]
						}
					},
					"response": []
				},
				{
					"name": "GET ALL ACTIVE PRODUCTS",
					"request": {
						"method": "GET",
						"header": [],
						"url": {
							"raw": "http://localhost:4000/products/active",
							"protocol": "http",
							"host": [
								"localhost"
							],
							"port": "4000",
							"path": [
								"products",
								"active"
							]
						}
					},
					"response": []
				},
				{
					"name": "GET SINGLE PRODUCT",
					"request": {
						"method": "GET",
						"header": [],
						"url": {
							"raw": "http://localhost:4000/products/6364aa023afe7f8902e09541",
							"protocol": "http",
							"host": [
								"localhost"
							],
							"port": "4000",
							"path": [
								"products",
								"6364aa023afe7f8902e09541"
							]
						}
					},
					"response": []
				},
				{
					"name": "UPDATE SINGLE PRODUCT",
					"request": {
						"auth": {
							"type": "bearer",
							"bearer": [
								{
									"key": "token",
									"value": "eyJhbGciOiJIUzI1NiIsInR5cCI6IkpXVCJ9.eyJpZCI6IjYzNjM4NDMzNzA1ZmJkNzk3N2YyOGEyMCIsImVtYWlsIjoieW9yaWNrQG1haWwuY29tIiwiaXNBZG1pbiI6dHJ1ZSwiaWF0IjoxNjY3NTQxNjAwfQ.UWSx13XlzpnhtIw5yfplVTzRmcZ-LylXH-4_60etqLE",
									"type": "string"
								}
							]
						},
						"method": "PATCH",
						"header": [],
						"body": {
							"mode": "raw",
							"raw": "{\n    \"price\" : 1000\n}",
							"options": {
								"raw": {
									"language": "json"
								}
							}
						},
						"url": {
							"raw": "http://localhost:4000/products/6364aa023afe7f8902e09541/update",
							"protocol": "http",
							"host": [
								"localhost"
							],
							"port": "4000",
							"path": [
								"products",
								"6364aa023afe7f8902e09541",
								"update"
							]
						}
					},
					"response": []
				},
				{
					"name": "ARCHIVE SINGLE PRODUCT",
					"request": {
						"auth": {
							"type": "bearer",
							"bearer": [
								{
									"key": "token",
									"value": "eyJhbGciOiJIUzI1NiIsInR5cCI6IkpXVCJ9.eyJpZCI6IjYzNjM4NDMzNzA1ZmJkNzk3N2YyOGEyMCIsImVtYWlsIjoieW9yaWNrQG1haWwuY29tIiwiaXNBZG1pbiI6dHJ1ZSwiaWF0IjoxNjY3NTQxODg5fQ.kAW3ZPH7hpEPsc71fdIruNVjZ2QIlWfS0RsPdbjg7Ng",
									"type": "string"
								}
							]
						},
						"method": "PATCH",
						"header": [],
						"url": {
							"raw": "http://localhost:4000/products/6364ab133afe7f8902e0954d/archive",
							"protocol": "http",
							"host": [
								"localhost"
							],
							"port": "4000",
							"path": [
								"products",
								"6364ab133afe7f8902e0954d",
								"archive"
							]
						}
					},
					"response": []
				}
			]
		}
	]
}