{
    "_id" : "507f1f77bcf86cd799439011",
    "firstName" : "Alas",
    "lastName" : "Sala",
    "email" : "alassala@gmail.com",
    "password" : "1234",
    "isAdmin" : false,
    "mobileNumber" : "091234567"
}
{
    "_id" : "507f1f77bcf86cd799439012",
    "firstName" : "Laas",
    "lastName" : "Saal",
    "email" : "laassaal@gmail.com",
    "password" : "4321",
    "isAdmin" : true,
    "mobileNumber" : "091234567"
}

{
    "_id" : "878sf86cd799439011",
    "name" : "Calculator",
    "description" : "scientific calculator for engineers",
    "price" : 2000,
    "stocks" : 50,
    "isActive" : true,
    "SKU" : 878989
}

{
    "orderid" : "Cal9784848b8",
    "productid" : "878sf86cd799439011",
    "quantity" : 1,
    "price" : 2000,
    "subtotal" : 2000

}


{

    "userid" : "507f1f77bcf86cd799439011",
    "transactionDate" : "2020-03-10T15:00:00.00Z",
    "isPaid" : true,
    "total" : 2000
    

}