{
		"id": "userId1",
		"username": "eric123",
		"firstName": "Eric",
		"lastName": "Magango",
		"email": "ericjohn@gmail.com",
		"password": "admin123",
		"mobileNumber": "09123456789",
		"isAdmin": false,
		"enrollments": [
			{
				"_id": "userEnrollment", 
				"courseId": "courseId1",
				"isPaid": true,
				"dateEnrolled": "2022-09-22"
			}
		]
}

{
		"id": "userId2",
		"username": "carlo123",
		"firstName": "Carlo",
		"lastName": "Magango",
		"email": "carlo123@gmail.com",
		"password": "admin456",
		"mobileNumber": "09474464642",
		"isAdmin": false,
		"enrollments": [
			{
				"_id": "userEnrollment",
				"userId": "userId2", 
				"courseId": "courseId2",
				"isPaid": true,
				"dateEnrolled": "2022-09-22"
			}
		]
}



{
		"id": "userId1",
		"username": "Eric",
		"lastName": "Magango",
		"email": "eric@gmail.com",
		"password": "admin123",
		"mobileNumber": "09123456789",
		"isAdmin": false,
}

{
		"id": "userId2",
		"username": "carlo123",
		"firstName": "Carlo",
		"lastName": "Magango",
		"email": "carlo123@gmail.com",
		"password": "admin456",
		"mobileNumber": "09474464642",
		"isAdmin": false,
}
