[

	{
		"_id": "userEnrollment1",
		"userId": "user1",
		"courseId": "course1",
		"isPaid": true,
		"dateTimeEnrolled": "2022-09-22"
	},
	{
		"_id": "userEnrollment2",
		"userId": "user2",
		"courseId": "course2",
		"isPaid": true,
		"dateTimeEnrolled": "2022-09-22"
	}

]