{
	"_id": 1,
	"firstName": "Jimmy",
	"lastName": "Neutral",
	"email": "jimmyneutral@gmail.com",
	"password": "jimmy12345678",
	"mobileNumber": "09673125468",
	"isAdmin": false,
},
{
	"_id": 2,
	"firstName": "Johny",
	"lastName": "Bravo",
	"email": "johnybravo@gmail.com",
	"password": "johny12345678",
	"mobileNumber": "09673125668",
	"isAdmin": false,
}