{
	"id": "courseId1",
	"name": "Full Stack Web Dev in JavaScript",
	"description": "Learn how to do web dev using JavaScript",
	"price": 5000,
	"slots": 30,
	"instructor": "John Smith",
	"isActive": true
}