{
	"info": {
		"_postman_id": "4b3407f1-ec76-49cb-bef6-51abd0474ab3",
		"name": "ecommerce_api",
		"schema": "https://schema.getpostman.com/json/collection/v2.1.0/collection.json",
		"_exporter_id": "23096980"
	},
	"item": [
		{
			"name": "User Request",
			"item": [
				{
					"name": "Register User",
					"request": {
						"method": "POST",
						"header": [],
						"body": {
							"mode": "raw",
							"raw": "{\r\n    \"firstName\": \"Buyer\",\r\n    \"lastName\": \"Ako\",\r\n    \"email\": \"buyer@mail.com\",\r\n    \"password\": \"1234\",\r\n    \"mobileNo\": \"09307226534\"\r\n}",
							"options": {
								"raw": {
									"language": "json"
								}
							}
						},
						"url": {
							"raw": "localhost:4000/api/users/register",
							"host": [
								"localhost"
							],
							"port": "4000",
							"path": [
								"api",
								"users",
								"register"
							]
						}
					},
					"response": [
						{
							"name": "Register User (Admin)",
							"originalRequest": {
								"method": "POST",
								"header": [],
								"body": {
									"mode": "raw",
									"raw": "{\r\n    \"firstName\": \"Admin\",\r\n    \"lastName\": \"Ako\",\r\n    \"email\": \"admin@mail.com\",\r\n    \"password\": \"admin123\",\r\n    \"mobileNo\": \"09307226534\"\r\n}",
									"options": {
										"raw": {
											"language": "json"
										}
									}
								},
								"url": {
									"raw": "localhost:4000/api/users/register",
									"host": [
										"localhost"
									],
									"port": "4000",
									"path": [
										"api",
										"users",
										"register"
									]
								}
							},
							"status": "Created",
							"code": 201,
							"_postman_previewlanguage": "html",
							"header": [
								{
									"key": "X-Powered-By",
									"value": "Express"
								},
								{
									"key": "Access-Control-Allow-Origin",
									"value": "*"
								},
								{
									"key": "Content-Type",
									"value": "text/html; charset=utf-8"
								},
								{
									"key": "Content-Length",
									"value": "32"
								},
								{
									"key": "ETag",
									"value": "W/\"20-xHxB6Qw0n+0bkGLYJFRVXd9cDRo\""
								},
								{
									"key": "Date",
									"value": "Wed, 07 Sep 2022 01:51:13 GMT"
								},
								{
									"key": "Connection",
									"value": "keep-alive"
								},
								{
									"key": "Keep-Alive",
									"value": "timeout=5"
								}
							],
							"cookie": [],
							"body": "User registration is successful!"
						}
					]
				},
				{
					"name": "User Login (Authentication)",
					"request": {
						"method": "POST",
						"header": [],
						"body": {
							"mode": "raw",
							"raw": "{\r\n    \"email\": \"buyer@mail.com\",\r\n    \"password\": \"1234\"\r\n}",
							"options": {
								"raw": {
									"language": "json"
								}
							}
						},
						"url": {
							"raw": "localhost:4000/api/users/login",
							"host": [
								"localhost"
							],
							"port": "4000",
							"path": [
								"api",
								"users",
								"login"
							]
						}
					},
					"response": [
						{
							"name": "User Authentication (Admin)",
							"originalRequest": {
								"method": "POST",
								"header": [],
								"body": {
									"mode": "raw",
									"raw": "{\r\n    \"email\": \"admin@mail.com\",\r\n    \"password\": \"admin123\"\r\n}",
									"options": {
										"raw": {
											"language": "json"
										}
									}
								},
								"url": {
									"raw": "localhost:4000/api/users/login",
									"host": [
										"localhost"
									],
									"port": "4000",
									"path": [
										"api",
										"users",
										"login"
									]
								}
							},
							"status": "OK",
							"code": 200,
							"_postman_previewlanguage": "json",
							"header": [
								{
									"key": "X-Powered-By",
									"value": "Express"
								},
								{
									"key": "Access-Control-Allow-Origin",
									"value": "*"
								},
								{
									"key": "Content-Type",
									"value": "application/json; charset=utf-8"
								},
								{
									"key": "Content-Length",
									"value": "219"
								},
								{
									"key": "ETag",
									"value": "W/\"db-Trqhw5O6XKyYLTSCTt8NMR78YFs\""
								},
								{
									"key": "Date",
									"value": "Wed, 07 Sep 2022 01:52:31 GMT"
								},
								{
									"key": "Connection",
									"value": "keep-alive"
								},
								{
									"key": "Keep-Alive",
									"value": "timeout=5"
								}
							],
							"cookie": [],
							"body": "{\n    \"accessToken\": \"eyJhbGciOiJIUzI1NiIsInR5cCI6IkpXVCJ9.eyJpZCI6IjYzMTdmOTExYjEyZThkYWNhZTlkYTE3MyIsImVtYWlsIjoiYWRtaW5AbWFpbC5jb20iLCJpc0FkbWluIjp0cnVlLCJpYXQiOjE2NjI1MTU1NTF9.F7g0HMbNfzuhjytRTZzt6flhySlryRPta-FoTL6mcBw\"\n}"
						}
					]
				},
				{
					"name": "Retrieve All User",
					"request": {
						"auth": {
							"type": "bearer",
							"bearer": [
								{
									"key": "token",
									"value": "eyJhbGciOiJIUzI1NiIsInR5cCI6IkpXVCJ9.eyJpZCI6IjYzMTdmOTExYjEyZThkYWNhZTlkYTE3MyIsImVtYWlsIjoiYWRtaW5AbWFpbC5jb20iLCJpc0FkbWluIjp0cnVlLCJpYXQiOjE2NjI1MTU1NTF9.F7g0HMbNfzuhjytRTZzt6flhySlryRPta-FoTL6mcBw",
									"type": "string"
								}
							]
						},
						"method": "GET",
						"header": [],
						"url": {
							"raw": "localhost:4000/api/users",
							"host": [
								"localhost"
							],
							"port": "4000",
							"path": [
								"api",
								"users"
							]
						}
					},
					"response": []
				},
				{
					"name": "View a Profile",
					"request": {
						"auth": {
							"type": "bearer",
							"bearer": [
								{
									"key": "token",
									"value": "eyJhbGciOiJIUzI1NiIsInR5cCI6IkpXVCJ9.eyJpZCI6IjYzMTdmOTExYjEyZThkYWNhZTlkYTE3MyIsImVtYWlsIjoiYWRtaW5AbWFpbC5jb20iLCJpc0FkbWluIjp0cnVlLCJpYXQiOjE2NjI1MTU1NTF9.F7g0HMbNfzuhjytRTZzt6flhySlryRPta-FoTL6mcBw",
									"type": "string"
								}
							]
						},
						"method": "GET",
						"header": [],
						"url": {
							"raw": "localhost:4000/api/users/details",
							"host": [
								"localhost"
							],
							"port": "4000",
							"path": [
								"api",
								"users",
								"details"
							]
						}
					},
					"response": [
						{
							"name": "View a Profile (Admin)",
							"originalRequest": {
								"method": "GET",
								"header": [],
								"url": {
									"raw": "localhost:4000/api/users/details",
									"host": [
										"localhost"
									],
									"port": "4000",
									"path": [
										"api",
										"users",
										"details"
									]
								}
							},
							"status": "OK",
							"code": 200,
							"_postman_previewlanguage": "json",
							"header": [
								{
									"key": "X-Powered-By",
									"value": "Express"
								},
								{
									"key": "Access-Control-Allow-Origin",
									"value": "*"
								},
								{
									"key": "Content-Type",
									"value": "application/json; charset=utf-8"
								},
								{
									"key": "Content-Length",
									"value": "170"
								},
								{
									"key": "ETag",
									"value": "W/\"aa-TKz2s0lyll4lWi2a2LMx8twBpg4\""
								},
								{
									"key": "Date",
									"value": "Wed, 07 Sep 2022 01:53:01 GMT"
								},
								{
									"key": "Connection",
									"value": "keep-alive"
								},
								{
									"key": "Keep-Alive",
									"value": "timeout=5"
								}
							],
							"cookie": [],
							"body": "{\n    \"_id\": \"6317f911b12e8dacae9da173\",\n    \"firstName\": \"Admin\",\n    \"lastName\": \"Ako\",\n    \"email\": \"admin@mail.com\",\n    \"password\": \"\",\n    \"mobileNo\": \"09307226534\",\n    \"isAdmin\": true,\n    \"orders\": [],\n    \"__v\": 0\n}"
						}
					]
				},
				{
					"name": "Buy A Product",
					"request": {
						"auth": {
							"type": "bearer",
							"bearer": [
								{
									"key": "token",
									"value": "",
									"type": "string"
								}
							]
						},
						"method": "POST",
						"header": [],
						"body": {
							"mode": "raw",
							"raw": "{\r\n    \"products\": [\r\n        {\r\n            \"productId\": \"63180601ab46a85f097f4b7c\",\r\n            \"productName\": \"One Piece Notebook\",\r\n            \"quantity\": 1\r\n        },\r\n        {\r\n            \"productId\": \"6318065ed715af6ae4543b36\",\r\n            \"productName\": \"One Piece T-shirt\",\r\n            \"quantity\": 1\r\n        },\r\n        {\r\n            \"productId\": \"631806ebd715af6ae4543b38\",\r\n            \"productName\": \"One Piece Short\",\r\n            \"quantity\": 1\r\n        }\r\n    ],\r\n    \r\n    \"totalAmount\": 900\r\n\r\n    \r\n}",
							"options": {
								"raw": {
									"language": "json"
								}
							}
						},
						"url": {
							"raw": "localhost:4000/api/users/checkout",
							"host": [
								"localhost"
							],
							"port": "4000",
							"path": [
								"api",
								"users",
								"checkout"
							]
						}
					},
					"response": [
						{
							"name": "Buy A Product (Customer)",
							"originalRequest": {
								"method": "POST",
								"header": [],
								"body": {
									"mode": "raw",
									"raw": "{\r\n    \"products\": [\r\n        {\r\n            \"productId\": \"63180601ab46a85f097f4b7c\",\r\n            \"productName\": \"One Piece Notebook\",\r\n            \"quantity\": 1\r\n        },\r\n        {\r\n            \"productId\": \"6318065ed715af6ae4543b36\",\r\n            \"productName\": \"One Piece T-shirt\",\r\n            \"quantity\": 1\r\n        }\r\n    ],\r\n    \r\n    \"totalAmount\": 600\r\n\r\n    \r\n}",
									"options": {
										"raw": {
											"language": "json"
										}
									}
								},
								"url": {
									"raw": "localhost:4000/api/users/checkout",
									"host": [
										"localhost"
									],
									"port": "4000",
									"path": [
										"api",
										"users",
										"checkout"
									]
								}
							},
							"status": "OK",
							"code": 200,
							"_postman_previewlanguage": "json",
							"header": [
								{
									"key": "X-Powered-By",
									"value": "Express"
								},
								{
									"key": "Access-Control-Allow-Origin",
									"value": "*"
								},
								{
									"key": "Content-Type",
									"value": "application/json; charset=utf-8"
								},
								{
									"key": "Content-Length",
									"value": "815"
								},
								{
									"key": "ETag",
									"value": "W/\"32f-Rk7JROP1vraIX8QerVNqb5JmWSY\""
								},
								{
									"key": "Date",
									"value": "Thu, 08 Sep 2022 03:37:11 GMT"
								},
								{
									"key": "Connection",
									"value": "keep-alive"
								},
								{
									"key": "Keep-Alive",
									"value": "timeout=5"
								}
							],
							"cookie": [],
							"body": "{\n    \"_id\": \"6317f8e1230afde5f4fccfdb\",\n    \"firstName\": \"Customer\",\n    \"lastName\": \"Ako\",\n    \"email\": \"customer@mail.com\",\n    \"password\": \"$2b$10$Xg7YSMS/CR0z19qQez.nsOT49GKRt2Y2Mg1UdWL7P8PBeY0JOq2S.\",\n    \"mobileNo\": \"09307226534\",\n    \"isAdmin\": false,\n    \"orders\": [\n        {\n            \"totalAmount\": 350,\n            \"purchasedOn\": \"2022-09-08T02:05:04.305Z\",\n            \"products\": [\n                {\n                    \"productId\": \"63180601ab46a85f097f4b7c\",\n                    \"productName\": \"One Piece Notebook\",\n                    \"quantity\": 1,\n                    \"_id\": \"63194dd4ed65816d1c3d81ac\"\n                }\n            ],\n            \"_id\": \"63194dd4ed65816d1c3d81ab\"\n        },\n        {\n            \"totalAmount\": 600,\n            \"purchasedOn\": \"2022-09-08T03:34:49.569Z\",\n            \"products\": [\n                {\n                    \"productId\": \"63180601ab46a85f097f4b7c\",\n                    \"productName\": \"One Piece Notebook\",\n                    \"quantity\": 1,\n                    \"_id\": \"631963670789c4f659f5acc5\"\n                },\n                {\n                    \"productId\": \"6318065ed715af6ae4543b36\",\n                    \"productName\": \"One Piece T-shirt\",\n                    \"quantity\": 1,\n                    \"_id\": \"631963670789c4f659f5acc6\"\n                }\n            ],\n            \"_id\": \"631963670789c4f659f5acc4\"\n        }\n    ],\n    \"__v\": 2\n}"
						},
						{
							"name": "Buy A Product (Admin)",
							"originalRequest": {
								"method": "POST",
								"header": [],
								"body": {
									"mode": "raw",
									"raw": "{\r\n    \"products\": [\r\n        {\r\n            \"productId\": \"63180601ab46a85f097f4b7c\",\r\n            \"productName\": \"One Piece Notebook\",\r\n            \"quantity\": 1\r\n        },\r\n        {\r\n            \"productId\": \"6318065ed715af6ae4543b36\",\r\n            \"productName\": \"One Piece T-shirt\",\r\n            \"quantity\": 1\r\n        }\r\n    ],\r\n    \r\n    \"totalAmount\": 600\r\n\r\n    \r\n}",
									"options": {
										"raw": {
											"language": "json"
										}
									}
								},
								"url": {
									"raw": "localhost:4000/api/users/checkout",
									"host": [
										"localhost"
									],
									"port": "4000",
									"path": [
										"api",
										"users",
										"checkout"
									]
								}
							},
							"status": "Unauthorized",
							"code": 401,
							"_postman_previewlanguage": "html",
							"header": [
								{
									"key": "X-Powered-By",
									"value": "Express"
								},
								{
									"key": "Access-Control-Allow-Origin",
									"value": "*"
								},
								{
									"key": "Content-Type",
									"value": "text/html; charset=utf-8"
								},
								{
									"key": "Content-Length",
									"value": "35"
								},
								{
									"key": "ETag",
									"value": "W/\"23-PScfNhxYE2WE4Sz5SbNyEC2le8g\""
								},
								{
									"key": "Date",
									"value": "Thu, 08 Sep 2022 03:43:01 GMT"
								},
								{
									"key": "Connection",
									"value": "keep-alive"
								},
								{
									"key": "Keep-Alive",
									"value": "timeout=5"
								}
							],
							"cookie": [],
							"body": "You cannot order products as admin."
						}
					]
				},
				{
					"name": "Set User to Admin",
					"request": {
						"auth": {
							"type": "bearer",
							"bearer": [
								{
									"key": "token",
									"value": "eyJhbGciOiJIUzI1NiIsInR5cCI6IkpXVCJ9.eyJpZCI6IjYzMTdmOTExYjEyZThkYWNhZTlkYTE3MyIsImVtYWlsIjoiYWRtaW5AbWFpbC5jb20iLCJpc0FkbWluIjp0cnVlLCJpYXQiOjE2NjI1MTU1NTF9.F7g0HMbNfzuhjytRTZzt6flhySlryRPta-FoTL6mcBw",
									"type": "string"
								}
							]
						},
						"method": "PATCH",
						"header": [],
						"body": {
							"mode": "raw",
							"raw": "{\r\n    \"isAdmin\": true\r\n}",
							"options": {
								"raw": {
									"language": "json"
								}
							}
						},
						"url": {
							"raw": "localhost:4000/api/users/6319f74b3e778f1800d1c0ac",
							"host": [
								"localhost"
							],
							"port": "4000",
							"path": [
								"api",
								"users",
								"6319f74b3e778f1800d1c0ac"
							]
						}
					},
					"response": [
						{
							"name": "Set User to Admin (Admin)",
							"originalRequest": {
								"method": "PATCH",
								"header": [],
								"body": {
									"mode": "raw",
									"raw": "{\r\n    \"isAdmin\": true\r\n}",
									"options": {
										"raw": {
											"language": "json"
										}
									}
								},
								"url": {
									"raw": "localhost:4000/api/users/6317f8e1230afde5f4fccfdb",
									"host": [
										"localhost"
									],
									"port": "4000",
									"path": [
										"api",
										"users",
										"6317f8e1230afde5f4fccfdb"
									]
								}
							},
							"status": "OK",
							"code": 200,
							"_postman_previewlanguage": "json",
							"header": [
								{
									"key": "X-Powered-By",
									"value": "Express"
								},
								{
									"key": "Access-Control-Allow-Origin",
									"value": "*"
								},
								{
									"key": "Content-Type",
									"value": "application/json; charset=utf-8"
								},
								{
									"key": "Content-Length",
									"value": "236"
								},
								{
									"key": "ETag",
									"value": "W/\"ec-sIx6mRROhbU65hwri2aHw+sQfzo\""
								},
								{
									"key": "Date",
									"value": "Thu, 08 Sep 2022 01:20:06 GMT"
								},
								{
									"key": "Connection",
									"value": "keep-alive"
								},
								{
									"key": "Keep-Alive",
									"value": "timeout=5"
								}
							],
							"cookie": [],
							"body": "{\n    \"_id\": \"6317f8e1230afde5f4fccfdb\",\n    \"firstName\": \"Customer\",\n    \"lastName\": \"Ako\",\n    \"email\": \"customer@mail.com\",\n    \"password\": \"$2b$10$Xg7YSMS/CR0z19qQez.nsOT49GKRt2Y2Mg1UdWL7P8PBeY0JOq2S.\",\n    \"mobileNo\": \"09307226534\",\n    \"isAdmin\": true,\n    \"orders\": [],\n    \"__v\": 0\n}"
						},
						{
							"name": "Set User to Admin (Customer)",
							"originalRequest": {
								"method": "PATCH",
								"header": [],
								"body": {
									"mode": "raw",
									"raw": "{\r\n    \"isAdmin\": true\r\n}",
									"options": {
										"raw": {
											"language": "json"
										}
									}
								},
								"url": {
									"raw": "localhost:4000/api/users/6317f8e1230afde5f4fccfdb",
									"host": [
										"localhost"
									],
									"port": "4000",
									"path": [
										"api",
										"users",
										"6317f8e1230afde5f4fccfdb"
									]
								}
							},
							"status": "Unauthorized",
							"code": 401,
							"_postman_previewlanguage": "html",
							"header": [
								{
									"key": "X-Powered-By",
									"value": "Express"
								},
								{
									"key": "Access-Control-Allow-Origin",
									"value": "*"
								},
								{
									"key": "Content-Type",
									"value": "text/html; charset=utf-8"
								},
								{
									"key": "Content-Length",
									"value": "35"
								},
								{
									"key": "ETag",
									"value": "W/\"23-ZoQhSLrPPejhpJCwKRoaoqaZtYM\""
								},
								{
									"key": "Date",
									"value": "Thu, 08 Sep 2022 01:20:57 GMT"
								},
								{
									"key": "Connection",
									"value": "keep-alive"
								},
								{
									"key": "Keep-Alive",
									"value": "timeout=5"
								}
							],
							"cookie": [],
							"body": "You don't have access to this page!"
						}
					]
				}
			]
		},
		{
			"name": "Product Request",
			"item": [
				{
					"name": "Create A Product",
					"request": {
						"auth": {
							"type": "bearer",
							"bearer": [
								{
									"key": "token",
									"value": "eyJhbGciOiJIUzI1NiIsInR5cCI6IkpXVCJ9.eyJpZCI6IjYzMTdmOTExYjEyZThkYWNhZTlkYTE3MyIsImVtYWlsIjoiYWRtaW5AbWFpbC5jb20iLCJpc0FkbWluIjp0cnVlLCJpYXQiOjE2NjI1MTU1NTF9.F7g0HMbNfzuhjytRTZzt6flhySlryRPta-FoTL6mcBw",
									"type": "string"
								}
							]
						},
						"method": "POST",
						"header": [],
						"body": {
							"mode": "raw",
							"raw": "{\r\n    \"name\": \"One Piece Poster\",\r\n    \"description\": \"Wano Arc Poster\",\r\n    \"price\": 100,\r\n    \"stocks\": 10\r\n}",
							"options": {
								"raw": {
									"language": "json"
								}
							}
						},
						"url": {
							"raw": "localhost:4000/api/products",
							"host": [
								"localhost"
							],
							"port": "4000",
							"path": [
								"api",
								"products"
							]
						}
					},
					"response": [
						{
							"name": "Create A Product (Admin)",
							"originalRequest": {
								"method": "POST",
								"header": [],
								"body": {
									"mode": "raw",
									"raw": "{\r\n    \"name\": \"One Piece T-shirt\",\r\n    \"description\": \"Black colored fabric t-shirt\",\r\n    \"price\": 450,\r\n    \"stocks\": 3\r\n}",
									"options": {
										"raw": {
											"language": "json"
										}
									}
								},
								"url": {
									"raw": "localhost:4000/api/products",
									"host": [
										"localhost"
									],
									"port": "4000",
									"path": [
										"api",
										"products"
									]
								}
							},
							"status": "Created",
							"code": 201,
							"_postman_previewlanguage": "html",
							"header": [
								{
									"key": "X-Powered-By",
									"value": "Express"
								},
								{
									"key": "Access-Control-Allow-Origin",
									"value": "*"
								},
								{
									"key": "Content-Type",
									"value": "text/html; charset=utf-8"
								},
								{
									"key": "Content-Length",
									"value": "29"
								},
								{
									"key": "ETag",
									"value": "W/\"1d-4K1QMFKpOAt1nkGcbP/R/lg/lFY\""
								},
								{
									"key": "Date",
									"value": "Wed, 07 Sep 2022 02:47:58 GMT"
								},
								{
									"key": "Connection",
									"value": "keep-alive"
								},
								{
									"key": "Keep-Alive",
									"value": "timeout=5"
								}
							],
							"cookie": [],
							"body": "Product successfully created!"
						},
						{
							"name": "Create A Product (Customer - Error)",
							"originalRequest": {
								"method": "POST",
								"header": [],
								"body": {
									"mode": "raw",
									"raw": "{\r\n    \"name\": \"One Piece Notebook\",\r\n    \"description\": \"One Piece Hard Notebook\",\r\n    \"price\": 350,\r\n    \"stocks\": 5\r\n}",
									"options": {
										"raw": {
											"language": "json"
										}
									}
								},
								"url": {
									"raw": "localhost:4000/api/products",
									"host": [
										"localhost"
									],
									"port": "4000",
									"path": [
										"api",
										"products"
									]
								}
							},
							"status": "OK",
							"code": 200,
							"_postman_previewlanguage": "json",
							"header": [
								{
									"key": "X-Powered-By",
									"value": "Express"
								},
								{
									"key": "Access-Control-Allow-Origin",
									"value": "*"
								},
								{
									"key": "Content-Type",
									"value": "application/json; charset=utf-8"
								},
								{
									"key": "Content-Length",
									"value": "53"
								},
								{
									"key": "ETag",
									"value": "W/\"35-WDTGUqIL7buAGXUi5tOw9VlcVfk\""
								},
								{
									"key": "Date",
									"value": "Wed, 07 Sep 2022 02:41:01 GMT"
								},
								{
									"key": "Connection",
									"value": "keep-alive"
								},
								{
									"key": "Keep-Alive",
									"value": "timeout=5"
								}
							],
							"cookie": [],
							"body": "{\n    \"error\": \"Authentication failed. No token provided!\"\n}"
						}
					]
				},
				{
					"name": "Retrieve All Active Products",
					"request": {
						"auth": {
							"type": "noauth"
						},
						"method": "GET",
						"header": [],
						"url": {
							"raw": "localhost:4000/api/products",
							"host": [
								"localhost"
							],
							"port": "4000",
							"path": [
								"api",
								"products"
							]
						}
					},
					"response": [
						{
							"name": "Retrieve All Active Products",
							"originalRequest": {
								"method": "GET",
								"header": [],
								"url": {
									"raw": "localhost:4000/api/products",
									"host": [
										"localhost"
									],
									"port": "4000",
									"path": [
										"api",
										"products"
									]
								}
							},
							"status": "OK",
							"code": 200,
							"_postman_previewlanguage": "json",
							"header": [
								{
									"key": "X-Powered-By",
									"value": "Express"
								},
								{
									"key": "Access-Control-Allow-Origin",
									"value": "*"
								},
								{
									"key": "Content-Type",
									"value": "application/json; charset=utf-8"
								},
								{
									"key": "Content-Length",
									"value": "283"
								},
								{
									"key": "ETag",
									"value": "W/\"11b-b+MYGwfTSmQwQhH4YnAqBvgI9sk\""
								},
								{
									"key": "Date",
									"value": "Wed, 07 Sep 2022 03:25:32 GMT"
								},
								{
									"key": "Connection",
									"value": "keep-alive"
								},
								{
									"key": "Keep-Alive",
									"value": "timeout=5"
								}
							],
							"cookie": [],
							"body": "[\n    {\n        \"name\": \"One Piece Notebook\",\n        \"description\": \"One Piece Hard Notebook\",\n        \"price\": 350,\n        \"stocks\": 5\n    },\n    {\n        \"name\": \"One Piece T-shirt\",\n        \"description\": \"Black colored fabric t-shirt\",\n        \"price\": 450,\n        \"stocks\": 3\n    },\n    {\n        \"name\": \"One Piece Short\",\n        \"description\": \"Gray colored cotton short\",\n        \"price\": 300,\n        \"stocks\": 4\n    }\n]"
						}
					]
				},
				{
					"name": "Retrieve All Products",
					"request": {
						"auth": {
							"type": "bearer",
							"bearer": [
								{
									"key": "token",
									"value": "eyJhbGciOiJIUzI1NiIsInR5cCI6IkpXVCJ9.eyJpZCI6IjYzMTdmOTExYjEyZThkYWNhZTlkYTE3MyIsImVtYWlsIjoiYWRtaW5AbWFpbC5jb20iLCJpc0FkbWluIjp0cnVlLCJpYXQiOjE2NjI1MTU1NTF9.F7g0HMbNfzuhjytRTZzt6flhySlryRPta-FoTL6mcBw",
									"type": "string"
								}
							]
						},
						"method": "GET",
						"header": [],
						"url": {
							"raw": "localhost:4000/api/products/all",
							"host": [
								"localhost"
							],
							"port": "4000",
							"path": [
								"api",
								"products",
								"all"
							]
						}
					},
					"response": [
						{
							"name": "Retrieve All Products (Admin)",
							"originalRequest": {
								"method": "GET",
								"header": [],
								"url": {
									"raw": "localhost:4000/api/products/all",
									"host": [
										"localhost"
									],
									"port": "4000",
									"path": [
										"api",
										"products",
										"all"
									]
								}
							},
							"status": "OK",
							"code": 200,
							"_postman_previewlanguage": "json",
							"header": [
								{
									"key": "X-Powered-By",
									"value": "Express"
								},
								{
									"key": "Access-Control-Allow-Origin",
									"value": "*"
								},
								{
									"key": "Content-Type",
									"value": "application/json; charset=utf-8"
								},
								{
									"key": "Content-Length",
									"value": "1031"
								},
								{
									"key": "ETag",
									"value": "W/\"407-vpo9QrO6bGqh8ElynzU4wJRbGpY\""
								},
								{
									"key": "Date",
									"value": "Wed, 07 Sep 2022 03:39:36 GMT"
								},
								{
									"key": "Connection",
									"value": "keep-alive"
								},
								{
									"key": "Keep-Alive",
									"value": "timeout=5"
								}
							],
							"cookie": [],
							"body": "[\n    {\n        \"_id\": \"63180601ab46a85f097f4b7c\",\n        \"name\": \"One Piece Notebook\",\n        \"description\": \"One Piece Hard Notebook\",\n        \"price\": 350,\n        \"stocks\": 5,\n        \"isActive\": true,\n        \"createdOn\": \"2022-09-07T02:46:24.179Z\",\n        \"orders\": [],\n        \"__v\": 0\n    },\n    {\n        \"_id\": \"6318065ed715af6ae4543b36\",\n        \"name\": \"One Piece T-shirt\",\n        \"description\": \"Black colored fabric t-shirt\",\n        \"price\": 450,\n        \"stocks\": 3,\n        \"isActive\": true,\n        \"createdOn\": \"2022-09-07T02:46:38.060Z\",\n        \"orders\": [],\n        \"__v\": 0\n    },\n    {\n        \"_id\": \"631806ebd715af6ae4543b38\",\n        \"name\": \"One Piece Short\",\n        \"description\": \"Gray colored cotton short\",\n        \"price\": 300,\n        \"stocks\": 4,\n        \"isActive\": true,\n        \"createdOn\": \"2022-09-07T02:46:38.060Z\",\n        \"orders\": [],\n        \"__v\": 0\n    },\n    {\n        \"_id\": \"63180f214fc3e1055e479612\",\n        \"name\": \"One Piece Hoodie\",\n        \"description\": \"Red colored hoodie made in fabric\",\n        \"price\": 1300,\n        \"stocks\": 5,\n        \"isActive\": false,\n        \"createdOn\": \"2022-09-07T03:23:56.750Z\",\n        \"orders\": [],\n        \"__v\": 0\n    },\n    {\n        \"_id\": \"63180f814fc3e1055e479615\",\n        \"name\": \"One Piece Jacket\",\n        \"description\": \"Brown colored jacket made in fabric\",\n        \"price\": 1100,\n        \"stocks\": 2,\n        \"isActive\": false,\n        \"createdOn\": \"2022-09-07T03:23:56.750Z\",\n        \"orders\": [],\n        \"__v\": 0\n    }\n]"
						},
						{
							"name": "Retrieve All Products (Customer)",
							"originalRequest": {
								"method": "GET",
								"header": [],
								"url": {
									"raw": "localhost:4000/api/products/all",
									"host": [
										"localhost"
									],
									"port": "4000",
									"path": [
										"api",
										"products",
										"all"
									]
								}
							},
							"status": "Unauthorized",
							"code": 401,
							"_postman_previewlanguage": "html",
							"header": [
								{
									"key": "X-Powered-By",
									"value": "Express"
								},
								{
									"key": "Access-Control-Allow-Origin",
									"value": "*"
								},
								{
									"key": "Content-Type",
									"value": "text/html; charset=utf-8"
								},
								{
									"key": "Content-Length",
									"value": "35"
								},
								{
									"key": "ETag",
									"value": "W/\"23-ZoQhSLrPPejhpJCwKRoaoqaZtYM\""
								},
								{
									"key": "Date",
									"value": "Wed, 07 Sep 2022 03:39:15 GMT"
								},
								{
									"key": "Connection",
									"value": "keep-alive"
								},
								{
									"key": "Keep-Alive",
									"value": "timeout=5"
								}
							],
							"cookie": [],
							"body": "You don't have access to this page!"
						}
					]
				},
				{
					"name": "Retrieve A Product",
					"request": {
						"auth": {
							"type": "noauth"
						},
						"method": "GET",
						"header": [],
						"url": {
							"raw": "localhost:4000/api/products/631806ebd715af6ae4543b38",
							"host": [
								"localhost"
							],
							"port": "4000",
							"path": [
								"api",
								"products",
								"631806ebd715af6ae4543b38"
							]
						}
					},
					"response": [
						{
							"name": "Retrieve A Product (Admin)",
							"originalRequest": {
								"method": "GET",
								"header": [],
								"url": {
									"raw": "localhost:4000/api/products/63180601ab46a85f097f4b7c",
									"host": [
										"localhost"
									],
									"port": "4000",
									"path": [
										"api",
										"products",
										"63180601ab46a85f097f4b7c"
									]
								}
							},
							"status": "OK",
							"code": 200,
							"_postman_previewlanguage": "json",
							"header": [
								{
									"key": "X-Powered-By",
									"value": "Express"
								},
								{
									"key": "Access-Control-Allow-Origin",
									"value": "*"
								},
								{
									"key": "Content-Type",
									"value": "application/json; charset=utf-8"
								},
								{
									"key": "Content-Length",
									"value": "200"
								},
								{
									"key": "ETag",
									"value": "W/\"c8-qrEhD8EWv5GD+XmN+Eg8nSvQY3s\""
								},
								{
									"key": "Date",
									"value": "Wed, 07 Sep 2022 04:00:47 GMT"
								},
								{
									"key": "Connection",
									"value": "keep-alive"
								},
								{
									"key": "Keep-Alive",
									"value": "timeout=5"
								}
							],
							"cookie": [],
							"body": "{\n    \"_id\": \"63180601ab46a85f097f4b7c\",\n    \"name\": \"One Piece Notebook\",\n    \"description\": \"One Piece Hard Notebook\",\n    \"price\": 350,\n    \"stocks\": 5,\n    \"isActive\": true,\n    \"createdOn\": \"2022-09-07T02:46:24.179Z\",\n    \"orders\": [],\n    \"__v\": 0\n}"
						},
						{
							"name": "Retrieve A Product (Customer)",
							"originalRequest": {
								"method": "GET",
								"header": [],
								"url": {
									"raw": "localhost:4000/api/products/63180601ab46a85f097f4b7c",
									"host": [
										"localhost"
									],
									"port": "4000",
									"path": [
										"api",
										"products",
										"63180601ab46a85f097f4b7c"
									]
								}
							},
							"status": "OK",
							"code": 200,
							"_postman_previewlanguage": "json",
							"header": [
								{
									"key": "X-Powered-By",
									"value": "Express"
								},
								{
									"key": "Access-Control-Allow-Origin",
									"value": "*"
								},
								{
									"key": "Content-Type",
									"value": "application/json; charset=utf-8"
								},
								{
									"key": "Content-Length",
									"value": "92"
								},
								{
									"key": "ETag",
									"value": "W/\"5c-EYbE25wGRVpbssPkPdJdAGgxGWM\""
								},
								{
									"key": "Date",
									"value": "Wed, 07 Sep 2022 04:00:16 GMT"
								},
								{
									"key": "Connection",
									"value": "keep-alive"
								},
								{
									"key": "Keep-Alive",
									"value": "timeout=5"
								}
							],
							"cookie": [],
							"body": "{\n    \"name\": \"One Piece Notebook\",\n    \"description\": \"One Piece Hard Notebook\",\n    \"price\": 350,\n    \"stocks\": 5\n}"
						}
					]
				},
				{
					"name": "Update A Product",
					"request": {
						"auth": {
							"type": "bearer",
							"bearer": [
								{
									"key": "token",
									"value": "eyJhbGciOiJIUzI1NiIsInR5cCI6IkpXVCJ9.eyJpZCI6IjYzMTdmOGUxMjMwYWZkZTVmNGZjY2ZkYiIsImVtYWlsIjoiY3VzdG9tZXJAbWFpbC5jb20iLCJpc0FkbWluIjpmYWxzZSwiaWF0IjoxNjYyNTE1NTIyfQ.cMa2HdyIDF85t5_UdjDa5gDnlpUcWgGP9ABn-umAIV8",
									"type": "string"
								}
							]
						},
						"method": "PUT",
						"header": [],
						"body": {
							"mode": "raw",
							"raw": "{\r\n    \"name\": \"One Piece Film Red Ticket\",\r\n    \"description\": \"Ticket for one piece film red\",\r\n    \"price\": 1650,\r\n    \"stocks\": 5\r\n}",
							"options": {
								"raw": {
									"language": "json"
								}
							}
						},
						"url": {
							"raw": "localhost:4000/api/products/6319b0e4bfa6e1506d6a47b1",
							"host": [
								"localhost"
							],
							"port": "4000",
							"path": [
								"api",
								"products",
								"6319b0e4bfa6e1506d6a47b1"
							]
						}
					},
					"response": [
						{
							"name": "Update A Product (Admin)",
							"originalRequest": {
								"method": "PUT",
								"header": [],
								"body": {
									"mode": "raw",
									"raw": "{\r\n    \"description\": \"Blue colored fabric t-shirt\",\r\n    \"price\": 250,\r\n    \"stocks\": 2\r\n}",
									"options": {
										"raw": {
											"language": "json"
										}
									}
								},
								"url": {
									"raw": "localhost:4000/api/products/6318065ed715af6ae4543b36",
									"host": [
										"localhost"
									],
									"port": "4000",
									"path": [
										"api",
										"products",
										"6318065ed715af6ae4543b36"
									]
								}
							},
							"status": "OK",
							"code": 200,
							"_postman_previewlanguage": "json",
							"header": [
								{
									"key": "X-Powered-By",
									"value": "Express"
								},
								{
									"key": "Access-Control-Allow-Origin",
									"value": "*"
								},
								{
									"key": "Content-Type",
									"value": "application/json; charset=utf-8"
								},
								{
									"key": "Content-Length",
									"value": "203"
								},
								{
									"key": "ETag",
									"value": "W/\"cb-/02lwmZVO3/GW/++MjWgxbGmDWU\""
								},
								{
									"key": "Date",
									"value": "Wed, 07 Sep 2022 04:22:35 GMT"
								},
								{
									"key": "Connection",
									"value": "keep-alive"
								},
								{
									"key": "Keep-Alive",
									"value": "timeout=5"
								}
							],
							"cookie": [],
							"body": "{\n    \"_id\": \"6318065ed715af6ae4543b36\",\n    \"name\": \"One Piece T-shirt\",\n    \"description\": \"Blue colored fabric t-shirt\",\n    \"price\": 250,\n    \"stocks\": 2,\n    \"isActive\": true,\n    \"createdOn\": \"2022-09-07T02:46:38.060Z\",\n    \"orders\": [],\n    \"__v\": 0\n}"
						},
						{
							"name": "Update A Product (Customer)",
							"originalRequest": {
								"method": "PUT",
								"header": [],
								"body": {
									"mode": "raw",
									"raw": "{\r\n    \"description\": \"Blue colored fabric t-shirt\",\r\n    \"price\": 250,\r\n    \"stocks\": 2\r\n}",
									"options": {
										"raw": {
											"language": "json"
										}
									}
								},
								"url": {
									"raw": "localhost:4000/api/products/6318065ed715af6ae4543b36",
									"host": [
										"localhost"
									],
									"port": "4000",
									"path": [
										"api",
										"products",
										"6318065ed715af6ae4543b36"
									]
								}
							},
							"status": "Unauthorized",
							"code": 401,
							"_postman_previewlanguage": "html",
							"header": [
								{
									"key": "X-Powered-By",
									"value": "Express"
								},
								{
									"key": "Access-Control-Allow-Origin",
									"value": "*"
								},
								{
									"key": "Content-Type",
									"value": "text/html; charset=utf-8"
								},
								{
									"key": "Content-Length",
									"value": "35"
								},
								{
									"key": "ETag",
									"value": "W/\"23-ZoQhSLrPPejhpJCwKRoaoqaZtYM\""
								},
								{
									"key": "Date",
									"value": "Wed, 07 Sep 2022 04:23:16 GMT"
								},
								{
									"key": "Connection",
									"value": "keep-alive"
								},
								{
									"key": "Keep-Alive",
									"value": "timeout=5"
								}
							],
							"cookie": [],
							"body": "You don't have access to this page!"
						}
					]
				},
				{
					"name": "Archive  A Product",
					"request": {
						"auth": {
							"type": "bearer",
							"bearer": [
								{
									"key": "token",
									"value": "eyJhbGciOiJIUzI1NiIsInR5cCI6IkpXVCJ9.eyJpZCI6IjYzMTdmOTExYjEyZThkYWNhZTlkYTE3MyIsImVtYWlsIjoiYWRtaW5AbWFpbC5jb20iLCJpc0FkbWluIjp0cnVlLCJpYXQiOjE2NjI1MTU1NTF9.F7g0HMbNfzuhjytRTZzt6flhySlryRPta-FoTL6mcBw",
									"type": "string"
								}
							]
						},
						"method": "PATCH",
						"header": [],
						"body": {
							"mode": "raw",
							"raw": "{\r\n    \"isActive\": false\r\n}",
							"options": {
								"raw": {
									"language": "json"
								}
							}
						},
						"url": {
							"raw": "localhost:4000/api/products/63197b001f089784350daddb",
							"host": [
								"localhost"
							],
							"port": "4000",
							"path": [
								"api",
								"products",
								"63197b001f089784350daddb"
							]
						}
					},
					"response": [
						{
							"name": "Archive  A Product (Admin)",
							"originalRequest": {
								"method": "PATCH",
								"header": [],
								"body": {
									"mode": "raw",
									"raw": "{\r\n    \"isActive\": false\r\n}",
									"options": {
										"raw": {
											"language": "json"
										}
									}
								},
								"url": {
									"raw": "localhost:4000/api/products/631806ebd715af6ae4543b38",
									"host": [
										"localhost"
									],
									"port": "4000",
									"path": [
										"api",
										"products",
										"631806ebd715af6ae4543b38"
									]
								}
							},
							"status": "OK",
							"code": 200,
							"_postman_previewlanguage": "json",
							"header": [
								{
									"key": "X-Powered-By",
									"value": "Express"
								},
								{
									"key": "Access-Control-Allow-Origin",
									"value": "*"
								},
								{
									"key": "Content-Type",
									"value": "application/json; charset=utf-8"
								},
								{
									"key": "Content-Length",
									"value": "200"
								},
								{
									"key": "ETag",
									"value": "W/\"c8-b0UG3F2hSq4nTs5mb8md5VH+ABQ\""
								},
								{
									"key": "Date",
									"value": "Wed, 07 Sep 2022 04:50:40 GMT"
								},
								{
									"key": "Connection",
									"value": "keep-alive"
								},
								{
									"key": "Keep-Alive",
									"value": "timeout=5"
								}
							],
							"cookie": [],
							"body": "{\n    \"_id\": \"631806ebd715af6ae4543b38\",\n    \"name\": \"One Piece Short\",\n    \"description\": \"Gray colored cotton short\",\n    \"price\": 300,\n    \"stocks\": 4,\n    \"isActive\": false,\n    \"createdOn\": \"2022-09-07T02:46:38.060Z\",\n    \"orders\": [],\n    \"__v\": 0\n}"
						},
						{
							"name": "Archive  A Product (Customer)",
							"originalRequest": {
								"method": "PATCH",
								"header": [],
								"body": {
									"mode": "raw",
									"raw": "{\r\n    \"isActive\": false\r\n}",
									"options": {
										"raw": {
											"language": "json"
										}
									}
								},
								"url": {
									"raw": "localhost:4000/api/products/631806ebd715af6ae4543b38",
									"host": [
										"localhost"
									],
									"port": "4000",
									"path": [
										"api",
										"products",
										"631806ebd715af6ae4543b38"
									]
								}
							},
							"status": "Unauthorized",
							"code": 401,
							"_postman_previewlanguage": "html",
							"header": [
								{
									"key": "X-Powered-By",
									"value": "Express"
								},
								{
									"key": "Access-Control-Allow-Origin",
									"value": "*"
								},
								{
									"key": "Content-Type",
									"value": "text/html; charset=utf-8"
								},
								{
									"key": "Content-Length",
									"value": "35"
								},
								{
									"key": "ETag",
									"value": "W/\"23-ZoQhSLrPPejhpJCwKRoaoqaZtYM\""
								},
								{
									"key": "Date",
									"value": "Wed, 07 Sep 2022 04:51:11 GMT"
								},
								{
									"key": "Connection",
									"value": "keep-alive"
								},
								{
									"key": "Keep-Alive",
									"value": "timeout=5"
								}
							],
							"cookie": [],
							"body": "You don't have access to this page!"
						}
					]
				}
			]
		}
	]
}