{
	"info": {
		"_postman_id": "c2574a4f-4a52-4de6-b114-14871318b4f4",
		"name": "Course-booking",
		"schema": "https://schema.getpostman.com/json/collection/v2.1.0/collection.json",
		"_exporter_id": "21679066"
	},
	"item": [
		{
			"name": "User Request",
			"item": [
				{
					"name": "Check email if exist",
					"request": {
						"method": "POST",
						"header": [],
						"body": {
							"mode": "raw",
							"raw": "\r\n    {\r\n    \"email\": \"johnsmith@mail.com\"\r\n}\r\n",
							"options": {
								"raw": {
									"language": "json"
								}
							}
						},
						"url": {
							"raw": "localhost:4000/users/checkEmail",
							"host": [
								"localhost"
							],
							"port": "4000",
							"path": [
								"users",
								"checkEmail"
							]
						}
					},
					"response": []
				},
				{
					"name": "User registration",
					"request": {
						"method": "POST",
						"header": [],
						"body": {
							"mode": "raw",
							"raw": "{\r\n    \"firstName\": \"Admin\",\r\n    \"lastName\": \"User\",\r\n    \"email\": \"admin@mail.com\",\r\n    \"password\": \"admin\",\r\n    \"mobileNumber\": \"09123456789\"\r\n}",
							"options": {
								"raw": {
									"language": "json"
								}
							}
						},
						"url": {
							"raw": "localhost:4000/users/register",
							"host": [
								"localhost"
							],
							"port": "4000",
							"path": [
								"users",
								"register"
							]
						}
					},
					"response": []
				},
				{
					"name": "User Authentication",
					"request": {
						"auth": {
							"type": "bearer",
							"bearer": [
								{
									"key": "token",
									"value": "eyJhbGciOiJIUzI1NiIsInR5cCI6IkpXVCJ9.eyJpZCI6IjYzMTZkOWE3NzkzMjQzOGIxMTUxMmFhNCIsImVtYWlsIjoiYWRtaW5AbWFpbC5jb20iLCJpc0FkbWluIjp0cnVlLCJpYXQiOjE2NjI0NDIyMDN9.eZxT7yyu0gzX4bnsaQNaGUXqOwg81jjYFFQj-nGxOPI",
									"type": "string"
								}
							]
						},
						"method": "POST",
						"header": [],
						"body": {
							"mode": "raw",
							"raw": "{\r\n    \"email\": \"johnsmith@mail.com\",\r\n    \"password\": \"john1234\"\r\n}",
							"options": {
								"raw": {
									"language": "json"
								}
							}
						},
						"url": {
							"raw": "localhost:4000/users/login",
							"host": [
								"localhost"
							],
							"port": "4000",
							"path": [
								"users",
								"login"
							]
						}
					},
					"response": []
				},
				{
					"name": "enroll a course",
					"request": {
						"auth": {
							"type": "bearer",
							"bearer": [
								{
									"key": "token",
									"value": "eyJhbGciOiJIUzI1NiIsInR5cCI6IkpXVCJ9.eyJpZCI6IjYzMTU4ZDk0YTA5OGU0OWY0YWEwOWFlNSIsImVtYWlsIjoiam9obnNtaXRoQG1haWwuY29tIiwiaXNBZG1pbiI6dHJ1ZSwiaWF0IjoxNjYyNDUxNjc2fQ.ELNI_PFhMO4o3aY58iC_tmmL6XUpdi2FNhkkZ_mTkcM",
									"type": "string"
								}
							]
						},
						"method": "POST",
						"header": [],
						"body": {
							"mode": "raw",
							"raw": "{\r\n    \"courseId\": \"6316b949b9a6675474493afd\"\r\n}",
							"options": {
								"raw": {
									"language": "json"
								}
							}
						},
						"url": {
							"raw": "localhost:4000/users/enroll",
							"host": [
								"localhost"
							],
							"port": "4000",
							"path": [
								"users",
								"enroll"
							]
						}
					},
					"response": []
				},
				{
					"name": "view user profile",
					"request": {
						"method": "GET",
						"header": []
					},
					"response": []
				}
			]
		},
		{
			"name": "S38 Activity",
			"item": [
				{
					"name": "New Request",
					"request": {
						"auth": {
							"type": "bearer",
							"bearer": [
								{
									"key": "token",
									"value": "eyJhbGciOiJIUzI1NiIsInR5cCI6IkpXVCJ9.eyJpZCI6IjYzMTU4ZDk0YTA5OGU0OWY0YWEwOWFlNSIsImVtYWlsIjoiam9obnNtaXRoQG1haWwuY29tIiwiaXNBZG1pbiI6ZmFsc2UsImlhdCI6MTY2MjQyNTA3OH0.QW6nHk1knoxSOqrDQpZ8kJaAlzgZjkH7UjEOyj8ISWc",
									"type": "string"
								}
							]
						},
						"method": "GET",
						"header": [],
						"url": {
							"raw": "localhost:4000/users/details",
							"host": [
								"localhost"
							],
							"port": "4000",
							"path": [
								"users",
								"details"
							]
						}
					},
					"response": []
				}
			]
		},
		{
			"name": "Course Request",
			"item": [
				{
					"name": "Add course",
					"request": {
						"auth": {
							"type": "bearer",
							"bearer": [
								{
									"key": "token",
									"value": "eyJhbGciOiJIUzI1NiIsInR5cCI6IkpXVCJ9.eyJpZCI6IjYzMTZkOWE3NzkzMjQzOGIxMTUxMmFhNCIsImVtYWlsIjoiYWRtaW5AbWFpbC5jb20iLCJpc0FkbWluIjp0cnVlLCJpYXQiOjE2NjI0NDIyMDN9.eZxT7yyu0gzX4bnsaQNaGUXqOwg81jjYFFQj-nGxOPI",
									"type": "string"
								}
							]
						},
						"method": "POST",
						"header": [],
						"body": {
							"mode": "raw",
							"raw": "{\r\n    \"name\": \"Sample\",\r\n    \"description\": \"Sample description\",\r\n    \"price\": 0,\r\n    \"slots\": 0\r\n}",
							"options": {
								"raw": {
									"language": "json"
								}
							}
						},
						"url": {
							"raw": "localhost:4000/courses",
							"host": [
								"localhost"
							],
							"port": "4000",
							"path": [
								"courses"
							]
						}
					},
					"response": []
				},
				{
					"name": "View all courses (admin)",
					"request": {
						"auth": {
							"type": "bearer",
							"bearer": [
								{
									"key": "token",
									"value": "eyJhbGciOiJIUzI1NiIsInR5cCI6IkpXVCJ9.eyJpZCI6IjYzMTZkOWE3NzkzMjQzOGIxMTUxMmFhNCIsImVtYWlsIjoiYWRtaW5AbWFpbC5jb20iLCJpc0FkbWluIjp0cnVlLCJpYXQiOjE2NjI0NDIyMDN9.eZxT7yyu0gzX4bnsaQNaGUXqOwg81jjYFFQj-nGxOPI",
									"type": "string"
								}
							]
						},
						"method": "GET",
						"header": [],
						"url": {
							"raw": "localhost:4000/courses/all",
							"host": [
								"localhost"
							],
							"port": "4000",
							"path": [
								"courses",
								"all"
							]
						}
					},
					"response": []
				},
				{
					"name": "View all active courses",
					"request": {
						"method": "GET",
						"header": [],
						"url": {
							"raw": "localhost:4000/courses/",
							"host": [
								"localhost"
							],
							"port": "4000",
							"path": [
								"courses",
								""
							]
						}
					},
					"response": []
				},
				{
					"name": "View a specific course",
					"request": {
						"method": "GET",
						"header": [],
						"url": {
							"raw": "localhost:4000/courses/6316dba26f1a994469fdc1ea",
							"host": [
								"localhost"
							],
							"port": "4000",
							"path": [
								"courses",
								"6316dba26f1a994469fdc1ea"
							]
						}
					},
					"response": []
				},
				{
					"name": "Updating a course",
					"request": {
						"auth": {
							"type": "bearer",
							"bearer": [
								{
									"key": "token",
									"value": "eyJhbGciOiJIUzI1NiIsInR5cCI6IkpXVCJ9.eyJpZCI6IjYzMTZkOWE3NzkzMjQzOGIxMTUxMmFhNCIsImVtYWlsIjoiYWRtaW5AbWFpbC5jb20iLCJpc0FkbWluIjp0cnVlLCJpYXQiOjE2NjI0NDIyMDN9.eZxT7yyu0gzX4bnsaQNaGUXqOwg81jjYFFQj-nGxOPI",
									"type": "string"
								}
							]
						},
						"method": "PUT",
						"header": [],
						"body": {
							"mode": "raw",
							"raw": "{\r\n    \"name\": \"Javascript\",\r\n    \"description\": \"Making websites interactive since the 90's\",\r\n    \"price\": 2500,\r\n    \"slots\": 30\r\n}",
							"options": {
								"raw": {
									"language": "json"
								}
							}
						},
						"url": {
							"raw": "localhost:4000/courses/6316ea9ff443187581b3fabe",
							"host": [
								"localhost"
							],
							"port": "4000",
							"path": [
								"courses",
								"6316ea9ff443187581b3fabe"
							]
						}
					},
					"response": []
				},
				{
					"name": "Archive a course",
					"request": {
						"auth": {
							"type": "bearer",
							"bearer": [
								{
									"key": "token",
									"value": "eyJhbGciOiJIUzI1NiIsInR5cCI6IkpXVCJ9.eyJpZCI6IjYzMTZkOWE3NzkzMjQzOGIxMTUxMmFhNCIsImVtYWlsIjoiYWRtaW5AbWFpbC5jb20iLCJpc0FkbWluIjp0cnVlLCJpYXQiOjE2NjI0NDIyMDN9.eZxT7yyu0gzX4bnsaQNaGUXqOwg81jjYFFQj-nGxOPI",
									"type": "string"
								}
							]
						},
						"method": "PATCH",
						"header": [],
						"body": {
							"mode": "raw",
							"raw": "{\r\n    \"isActive\": true\r\n}",
							"options": {
								"raw": {
									"language": "json"
								}
							}
						},
						"url": {
							"raw": "localhost:4000/courses/archive/6316ea9ff443187581b3fabe",
							"host": [
								"localhost"
							],
							"port": "4000",
							"path": [
								"courses",
								"archive",
								"6316ea9ff443187581b3fabe"
							]
						}
					},
					"response": []
				}
			]
		}
	]
}