{
	"info": {
		"_postman_id": "c8899a57-d44e-4b61-b965-2f7698cf9d8f",
		"name": "0ecommerceRequest",
		"schema": "https://schema.getpostman.com/json/collection/v2.1.0/collection.json",
		"_exporter_id": "22386775"
	},
	"item": [
		{
			"name": "UserAccountRequest",
			"item": [
				{
					"name": "Register User",
					"request": {
						"auth": {
							"type": "noauth"
						},
						"method": "POST",
						"header": [],
						"body": {
							"mode": "raw",
							"raw": "{\r\n\t\"userAccountFirstName\": \"Maynard\",\r\n\t\"userAccountLastName\": \"Keenan\",\r\n\t\"userAccountEmail\": \"maynardkeenan@mail.com\",\r\n\t\"userAccountPassword\": \"Maynardkeenan1!\",\r\n\t\"userAccountMobileNumber\": \"09136549964\"\r\n}",
							"options": {
								"raw": {
									"language": "json"
								}
							}
						},
						"url": {
							"raw": "localhost:4000/useraccounts/register",
							"host": [
								"localhost"
							],
							"port": "4000",
							"path": [
								"useraccounts",
								"register"
							]
						}
					},
					"response": []
				},
				{
					"name": "Login User",
					"request": {
						"method": "POST",
						"header": [],
						"body": {
							"mode": "raw",
							"raw": "{\r\n    \"userAccountEmail\": \"maynardkeenan@mail.com\",\r\n    \"userAccountPassword\": \"Maynardkeenan1!\"\r\n}",
							"options": {
								"raw": {
									"language": "json"
								}
							}
						},
						"url": {
							"raw": "localhost:4000/useraccounts/login",
							"host": [
								"localhost"
							],
							"port": "4000",
							"path": [
								"useraccounts",
								"login"
							]
						}
					},
					"response": []
				}
			]
		},
		{
			"name": "ProductItemRequest",
			"item": []
		}
	]
}