{
	"info": {
		"_postman_id": "8d586245-ced9-4968-87f4-4c56e7aa3d8d",
		"name": "course-booking",
		"schema": "https://schema.getpostman.com/json/collection/v2.1.0/collection.json",
		"_exporter_id": "22386775"
	},
	"item": [
		{
			"name": "Check email if exists",
			"protocolProfileBehavior": {
				"disableBodyPruning": true
			},
			"request": {
				"method": "GET",
				"header": [],
				"body": {
					"mode": "raw",
					"raw": "{\r\n    \"email\":\"johnsmith@mail.com\"\r\n}",
					"options": {
						"raw": {
							"language": "json"
						}
					}
				},
				"url": {
					"raw": "localhost:4000/users/checkEmail",
					"host": [
						"localhost"
					],
					"port": "4000",
					"path": [
						"users",
						"checkEmail"
					]
				}
			},
			"response": []
		},
		{
			"name": "User registration",
			"request": {
				"method": "POST",
				"header": [],
				"body": {
					"mode": "raw",
					"raw": "{\r\n      \"firstName\": \"John\",\r\n        \"lastName\": \"Smith\",\r\n        \"email\": \"johnsmith@mail.com\",\r\n        \"password\": \"john1234\",\r\n        \"mobileNumber\": \"09123456789\"\r\n}",
					"options": {
						"raw": {
							"language": "json"
						}
					}
				},
				"url": {
					"raw": "localhost:4000/users/register",
					"host": [
						"localhost"
					],
					"port": "4000",
					"path": [
						"users",
						"register"
					]
				}
			},
			"response": []
		},
		{
			"name": "User authentication",
			"request": {
				"method": "POST",
				"header": [],
				"body": {
					"mode": "raw",
					"raw": "{\r\n    \"email\": \"johnsmith@mail.com\",\r\n    \"password\": \"john1234\"\r\n}",
					"options": {
						"raw": {
							"language": "json"
						}
					}
				},
				"url": {
					"raw": "localhost:4000/users/login",
					"host": [
						"localhost"
					],
					"port": "4000",
					"path": [
						"users",
						"login"
					]
				}
			},
			"response": []
		},
		{
			"name": "Update user details",
			"request": {
				"method": "GET",
				"header": [],
				"url": {
					"raw": "localhost:4000/users/details/63158ab84bbba550c4fb92a3",
					"host": [
						"localhost"
					],
					"port": "4000",
					"path": [
						"users",
						"details",
						"63158ab84bbba550c4fb92a3"
					]
				}
			},
			"response": []
		}
	]
}