{
	"info": {
		"_postman_id": "9efb6c5a-62ec-4f8c-a799-dd3c1f73af3e",
		"name": "s32 _act",
		"schema": "https://schema.getpostman.com/json/collection/v2.1.0/collection.json",
		"_exporter_id": "23096985"
	},
	"item": [
		{
			"name": "Homepage GET route",
			"request": {
				"method": "GET",
				"header": [],
				"url": {
					"raw": "localhost:4000/",
					"host": [
						"localhost"
					],
					"port": "4000",
					"path": [
						""
					]
				}
			},
			"response": []
		},
		{
			"name": "Profile GET Route",
			"request": {
				"method": "GET",
				"header": [],
				"url": {
					"raw": "localhost:4000/profile",
					"host": [
						"localhost"
					],
					"port": "4000",
					"path": [
						"profile"
					]
				}
			},
			"response": []
		},
		{
			"name": "Course GET Route",
			"request": {
				"method": "GET",
				"header": [],
				"url": {
					"raw": "localhost:4000/courses",
					"host": [
						"localhost"
					],
					"port": "4000",
					"path": [
						"courses"
					]
				}
			},
			"response": []
		},
		{
			"name": "Course POST Route",
			"request": {
				"method": "POST",
				"header": [],
				"url": {
					"raw": "localhost:4000/addcourse",
					"host": [
						"localhost"
					],
					"port": "4000",
					"path": [
						"addcourse"
					]
				}
			},
			"response": []
		},
		{
			"name": "Course PUT Route",
			"request": {
				"method": "PUT",
				"header": [],
				"url": {
					"raw": "localhost:4000/updatecourse",
					"host": [
						"localhost"
					],
					"port": "4000",
					"path": [
						"updatecourse"
					]
				}
			},
			"response": []
		},
		{
			"name": "Course DELETE Route",
			"request": {
				"method": "DELETE",
				"header": [],
				"url": {
					"raw": "localhost:4000/archivecourses",
					"host": [
						"localhost"
					],
					"port": "4000",
					"path": [
						"archivecourses"
					]
				}
			},
			"response": []
		}
	]
}