{
	"info": {
		"_postman_id": "c295e283-02c5-4ff7-b7a2-9d7b9b3e002d",
		"name": "s36",
		"schema": "https://schema.getpostman.com/json/collection/v2.1.0/collection.json",
		"_exporter_id": "22645156"
	},
	"item": [
		{
			"name": "get task",
			"protocolProfileBehavior": {
				"disableBodyPruning": true
			},
			"request": {
				"method": "GET",
				"header": [],
				"body": {
					"mode": "raw",
					"raw": "{\r\n    \"name\": \"Coding\"\r\n}",
					"options": {
						"raw": {
							"language": "json"
						}
					}
				},
				"url": {
					"raw": "localhost:3501/tasks/getAll",
					"host": [
						"localhost"
					],
					"port": "3501",
					"path": [
						"tasks",
						"getAll"
					]
				}
			},
			"response": []
		},
		{
			"name": "update task",
			"request": {
				"method": "PATCH",
				"header": [],
				"body": {
					"mode": "raw",
					"raw": "{\r\n    \"status\": \"completed\"\r\n}",
					"options": {
						"raw": {
							"language": "json"
						}
					}
				},
				"url": {
					"raw": "localhost:3001/tasks/updateTask/6311744a927c18bfa88c519c",
					"host": [
						"localhost"
					],
					"port": "3001",
					"path": [
						"tasks",
						"updateTask",
						"6311744a927c18bfa88c519c"
					]
				}
			},
			"response": []
		},
		{
			"name": "create task",
			"request": {
				"method": "POST",
				"header": [],
				"body": {
					"mode": "raw",
					"raw": "{\r\n    \"name\": \"task whatever\"\r\n}",
					"options": {
						"raw": {
							"language": "json"
						}
					}
				},
				"url": {
					"raw": "localhost:3001/tasks/create",
					"host": [
						"localhost"
					],
					"port": "3001",
					"path": [
						"tasks",
						"create"
					]
				}
			},
			"response": []
		},
		{
			"name": "delete task",
			"request": {
				"method": "DELETE",
				"header": [],
				"body": {
					"mode": "raw",
					"raw": "",
					"options": {
						"raw": {
							"language": "json"
						}
					}
				},
				"url": {
					"raw": "localhost:3001/tasks/deleteTask/6311792e62e3377b463ee859",
					"host": [
						"localhost"
					],
					"port": "3001",
					"path": [
						"tasks",
						"deleteTask",
						"6311792e62e3377b463ee859"
					]
				}
			},
			"response": []
		}
	]
}