{
	"info": {
		"_postman_id": "4791e2f3-9224-4889-b63d-a5dedfa39bd6",
		"name": "S30",
		"schema": "https://schema.getpostman.com/json/collection/v2.1.0/collection.json",
		"_exporter_id": "21501101"
	},
	"item": [
		{
			"name": "Create a Task",
			"request": {
				"method": "POST",
				"header": [],
				"body": {
					"mode": "raw",
					"raw": "{\r\n    \"name\":\"Write\"\r\n}",
					"options": {
						"raw": {
							"language": "json"
						}
					}
				},
				"url": {
					"raw": "localhost:3001/tasks",
					"host": [
						"localhost"
					],
					"port": "3001",
					"path": [
						"tasks"
					]
				}
			},
			"response": []
		},
		{
			"name": "View All Tasks",
			"request": {
				"method": "GET",
				"header": [],
				"url": {
					"raw": "localhost:3001/tasks",
					"host": [
						"localhost"
					],
					"port": "3001",
					"path": [
						"tasks"
					]
				}
			},
			"response": []
		},
		{
			"name": "New User",
			"request": {
				"method": "POST",
				"header": [],
				"body": {
					"mode": "raw",
					"raw": "{\r\n    \"name\": \"Jack\",\r\n    \"password\": \"123456\"\r\n}",
					"options": {
						"raw": {
							"language": "json"
						}
					}
				},
				"url": {
					"raw": "localhost:3001/newReg",
					"host": [
						"localhost"
					],
					"port": "3001",
					"path": [
						"newReg"
					]
				}
			},
			"response": []
		},
		{
			"name": "View All Users",
			"request": {
				"method": "GET",
				"header": [],
				"url": {
					"raw": "localhost:3001/viewUsers",
					"host": [
						"localhost"
					],
					"port": "3001",
					"path": [
						"viewUsers"
					]
				}
			},
			"response": []
		}
	]
}