{
	"info": {
		"_postman_id": "53b249cf-f124-4e31-8456-9ac8b7157f10",
		"name": "S29",
		"schema": "https://schema.getpostman.com/json/collection/v2.1.0/collection.json",
		"_exporter_id": "13653604"
	},
	"item": [
		{
			"name": "d1",
			"item": [
				{
					"name": "get request in the base Url",
					"request": {
						"method": "GET",
						"header": [],
						"url": {
							"raw": "localhost:3000",
							"host": [
								"localhost"
							],
							"port": "3000"
						}
					},
					"response": []
				},
				{
					"name": "Hello end point",
					"request": {
						"method": "GET",
						"header": [],
						"url": {
							"raw": "localhost:3000/hello",
							"host": [
								"localhost"
							],
							"port": "3000",
							"path": [
								"hello"
							]
						}
					},
					"response": []
				},
				{
					"name": "POST request in the hello endpoint",
					"request": {
						"method": "POST",
						"header": [],
						"body": {
							"mode": "raw",
							"raw": "{\r\n    \"firsName\":\"John\",\r\n    \"lastName\":\"Doe\"\r\n}",
							"options": {
								"raw": {
									"language": "json"
								}
							}
						},
						"url": {
							"raw": "localhost:3000/hello",
							"host": [
								"localhost"
							],
							"port": "3000",
							"path": [
								"hello"
							]
						}
					},
					"response": []
				},
				{
					"name": "Create a user",
					"request": {
						"method": "POST",
						"header": [],
						"body": {
							"mode": "raw",
							"raw": "{\r\n    \"userName\":\"Johndoe\",\r\n    \"password\":\"john123\"\r\n}",
							"options": {
								"raw": {
									"language": "json"
								}
							}
						},
						"url": {
							"raw": "localhost:3000/signup",
							"host": [
								"localhost"
							],
							"port": "3000",
							"path": [
								"signup"
							]
						}
					},
					"response": []
				},
				{
					"name": "View all Users",
					"request": {
						"method": "GET",
						"header": [],
						"url": {
							"raw": "localhost:3000/users",
							"host": [
								"localhost"
							],
							"port": "3000",
							"path": [
								"users"
							]
						}
					},
					"response": []
				},
				{
					"name": "Update a user password",
					"request": {
						"method": "PATCH",
						"header": [],
						"body": {
							"mode": "raw",
							"raw": "{\r\n    \"userName\":\"Johndoe\",\r\n    \"password\":\"123456\"\r\n}",
							"options": {
								"raw": {
									"language": "json"
								}
							}
						},
						"url": {
							"raw": "localhost:3000/change-password",
							"host": [
								"localhost"
							],
							"port": "3000",
							"path": [
								"change-password"
							]
						}
					},
					"response": []
				}
			]
		},
		{
			"name": "a1",
			"item": [
				{
					"name": "Homepage",
					"request": {
						"method": "GET",
						"header": [],
						"url": {
							"raw": "localhost:3000/home",
							"host": [
								"localhost"
							],
							"port": "3000",
							"path": [
								"home"
							]
						}
					},
					"response": []
				},
				{
					"name": "Delete Users",
					"request": {
						"method": "DELETE",
						"header": [],
						"url": {
							"raw": "localhost:3000/delete-user",
							"host": [
								"localhost"
							],
							"port": "3000",
							"path": [
								"delete-user"
							]
						}
					},
					"response": []
				}
			]
		}
	]
}