

{
    "productId:": "productId123",
    "product": "Doowee Donut",
    "description": "Choco Donut with flavored filling",
    "price": 10,
    "stocks": 100,
    "isActive": true,
    "sku": "qwe123"
}